Name: [UPG][15.0] to_sale_price_lock: upgrade module to_sale_price_lock to 15.0

State: Revoked

PR State: open

PR Author: Phùng Văn Tuyến

PR Author Email:

PR: #5864

Committer: tuyenphung

Committer Email: phungvantuyen97@gmail.com

Commit: b1dd661e33968f9e1a4ea163dbdc3205e8a38180

Description:

                                            [UPG] to_sale_price_lock: upgrade module to_sale_price_lock to 15.0
                                            

Branch: 15.0

Instance ID: 48057

Age:

Up-time:

Odoo 15.0

Test at install odoo 15.0

  • create_db create_db: db
  • set_opt set_opt: demo,test
  • set_opt set_opt: test-tags=-post_install,-/base_setup:TestResConfig.test_install,-:WebSuite.test_js,-:TestIsMultiLang.test_02_url_lang_code_underscore,-:TestUi.test_01_main_flow_tour,-:WebSuite.test_check_suite,-:TestTermCount.test_export_empty_string,-:TestLeadAssignPerf.test_assign_perf_populated
  • install_module install_module: l10n_generic_coa,{all},-hw_drivers,-hw_escpos,-hw_posbox_homepage,-hw_proxy,-pad,-pad_project,-l10n_latam_base,-l10n_ua,-l10n_hk,-l10n_es_edi_sii,-l10n_au,-l10n_dk,-l10n_uk,-l10n_id,-l10n_bo,-l10n_il,-l10n_cn_small_business,-l10n_hr,-l10n_co_pos,-l10n_cz,-l10n_ae,-l10n_pt,-l10n_it_stock_ddt,-l10n_id_efaktur,-l10n_de_repair,-l10n_be_edi,-l10n_it,-l10n_gt,-l10n_ch,-l10n_dz,-l10n_pa,-l10n_cr,-l10n_ve,-l10n_tr,-l10n_eu_service,-l10n_sg,-l10n_de_skr03,-l10n_ie,-l10n_jp,-l10n_ro,-l10n_nz,-l10n_fr,-l10n_de_sale,-l10n_in_sale,-l10n_ar_website_sale,-l10n_de_stock,-l10n_us,-l10n_pe,-l10n_cn_standard,-l10n_it_edi_sdicoop,-l10n_cn_city,-l10n_sa,-l10n_mn,-l10n_in_sale_stock,-l10n_do,-l10n_cl,-l10n_ar,-l10n_lt,-l10n_vn,-l10n_syscohada,-l10n_nl,-l10n_br,-l10n_mx,-l10n_hn,-l10n_ch_qriban,-l10n_in_purchase_stock,-l10n_si,-l10n_be,-l10n_fi,-l10n_in_pos,-l10n_za,-l10n_at,-l10n_ma,-l10n_pl,-l10n_ec,-l10n_fr_pos_cert,-l10n_in,-l10n_in_stock,-l10n_th,-l10n_ca,-l10n_de_skr04,-l10n_uy,-l10n_de_purchase,-l10n_latam_invoice_document,-l10n_et,-l10n_se_ocr,-l10n_es,-l10n_hu,-l10n_no,-l10n_be_invoice_bba,-l10n_in_purchase,-l10n_gr,-l10n_sk,-l10n_co,-l10n_it_edi,-l10n_de,-l10n_multilang,-l10n_cn,-l10n_fr_fec,-l10n_se,-l10n_lu,-l10n_ae_pos,-note_pad,-odoo,-l10n_fr_facturx_chorus_pro,-l10n_account_edi_ubl_cii_tests,-l10n_eg,-l10n_eg_edi_eta,-l10n_eu_oss,-l10n_fi_sale,-l10n_gcc_invoice,-l10n_gcc_pos,-l10n_in_edi,-l10n_ke,-l10n_nl_edi,-l10n_no_edi,-l10n_pk,-l10n_sa_invoice,-l10n_sa_pos,-l10n_tw,-hw_l10n_eg_eta

Test post install odoo 15.0

  • exec_odoo exec_odoo: --log-level=warn --max-cron-threads=0 --workers=0 --test-enable --test-tags=-at_install,-.test_assign_perf_duplicates,-.test_assign_perf_no_duplicates,-.test_assign_perf_populated,-/web:WebSuite.test_js,-:TestIsMultiLang.test_02_url_lang_code_underscore,-:TestUi.test_01_main_flow_tour,-:WebSuite.test_check_suite,-:TestTermCount.test_export_empty_string,-:TestLifoPrice.test_lifoprice,-:BuckarooTest.test_redirect_form_values,-:SipsTest.test_redirect_form_values,-pad,-pad_project
Create Date Level Message
09/22/2022 22:06:10 INFO
Start setup environment for runbot instance mug7nipybin4-125778
09/22/2022 22:06:14 INFO
Fetching repository source code
09/22/2022 22:06:16 INFO
Create ref local branch to remote source
09/22/2022 22:06:18 INFO
Create working tree from branch: pr_mug7nipybin4-125778
09/22/2022 22:06:20 INFO
Validating git dependencies source code
09/22/2022 22:06:20 INFO
Check and clone git dependencies source code
09/22/2022 22:06:20 INFO
Collected build addons:
09/22/2022 22:06:21 INFO
Deployed config file
09/22/2022 22:06:23 INFO
Running step: Test at install odoo 15.0
09/22/2022 22:06:23 INFO
Run command: create_db args: db
09/22/2022 22:06:25 INFO
Created database: mug7nipybin4-125778_db
09/22/2022 22:06:26 INFO
Run command: set_opt args: demo,test
09/22/2022 22:06:26 INFO
Run command: set_opt args: test-tags=-post_install,-/base_setup:TestResConfig.test_install,-:WebSuite.test_js,-:TestIsMultiLang.test_02_url_lang_code_underscore,-:TestUi.test_01_main_flow_tour,-:WebSuite.test_check_suite,-:TestTermCount.test_export_empty_string,-:TestLeadAssignPerf.test_assign_perf_populated
09/22/2022 22:06:27 INFO
Run command: install_module args: l10n_generic_coa,{all},-hw_drivers,-hw_escpos,-hw_posbox_homepage,-hw_proxy,-pad,-pad_project,-l10n_latam_base,-l10n_ua,-l10n_hk,-l10n_es_edi_sii,-l10n_au,-l10n_dk,-l10n_uk,-l10n_id,-l10n_bo,-l10n_il,-l10n_cn_small_business,-l10n_hr,-l10n_co_pos,-l10n_cz,-l10n_ae,-l10n_pt,-l10n_it_stock_ddt,-l10n_id_efaktur,-l10n_de_repair,-l10n_be_edi,-l10n_it,-l10n_gt,-l10n_ch,-l10n_dz,-l10n_pa,-l10n_cr,-l10n_ve,-l10n_tr,-l10n_eu_service,-l10n_sg,-l10n_de_skr03,-l10n_ie,-l10n_jp,-l10n_ro,-l10n_nz,-l10n_fr,-l10n_de_sale,-l10n_in_sale,-l10n_ar_website_sale,-l10n_de_stock,-l10n_us,-l10n_pe,-l10n_cn_standard,-l10n_it_edi_sdicoop,-l10n_cn_city,-l10n_sa,-l10n_mn,-l10n_in_sale_stock,-l10n_do,-l10n_cl,-l10n_ar,-l10n_lt,-l10n_vn,-l10n_syscohada,-l10n_nl,-l10n_br,-l10n_mx,-l10n_hn,-l10n_ch_qriban,-l10n_in_purchase_stock,-l10n_si,-l10n_be,-l10n_fi,-l10n_in_pos,-l10n_za,-l10n_at,-l10n_ma,-l10n_pl,-l10n_ec,-l10n_fr_pos_cert,-l10n_in,-l10n_in_stock,-l10n_th,-l10n_ca,-l10n_de_skr04,-l10n_uy,-l10n_de_purchase,-l10n_latam_invoice_document,-l10n_et,-l10n_se_ocr,-l10n_es,-l10n_hu,-l10n_no,-l10n_be_invoice_bba,-l10n_in_purchase,-l10n_gr,-l10n_sk,-l10n_co,-l10n_it_edi,-l10n_de,-l10n_multilang,-l10n_cn,-l10n_fr_fec,-l10n_se,-l10n_lu,-l10n_ae_pos,-note_pad,-odoo,-l10n_fr_facturx_chorus_pro,-l10n_account_edi_ubl_cii_tests,-l10n_eg,-l10n_eg_edi_eta,-l10n_eu_oss,-l10n_fi_sale,-l10n_gcc_invoice,-l10n_gcc_pos,-l10n_in_edi,-l10n_ke,-l10n_nl_edi,-l10n_no_edi,-l10n_pk,-l10n_sa_invoice,-l10n_sa_pos,-l10n_tw,-hw_l10n_eg_eta
09/22/2022 22:06:29 INFO
Installed module(s): l10n_generic_coa,base,test_access_rights,test_action_bindings,test_apikeys,test_assetsbundle,test_auth_custom,test_convert,test_converter,test_data_module,test_data_module_install,test_exceptions,test_impex,test_inherit,test_inherit_depends,test_inherits,test_inherits_depends,test_limits,test_lint,test_main_flows,test_mimetypes,test_new_api,test_performance,test_populate,test_read_group,test_rpc,test_search_panel,test_testing_utilities,test_translation_import,test_uninstall,account,account_check_printing,account_debit_note,account_edi,account_edi_facturx,account_edi_proxy_client,account_edi_ubl,account_edi_ubl_bis3,account_edi_ubl_cii,account_fleet,account_lock,account_payment,account_qr_code_sepa,account_sale_timesheet,account_tax_python,account_test,analytic,association,attachment_indexation,auth_ldap,auth_oauth,auth_password_policy,auth_password_policy_portal,auth_password_policy_signup,auth_signup,auth_totp,auth_totp_mail,auth_totp_mail_enforce,auth_totp_portal,barcodes,barcodes_gs1_nomenclature,base_address_city,base_address_extended,base_automation,base_geolocalize,base_iban,base_import,base_import_module,base_setup,base_sparse_field,base_vat,board,bus,calendar,calendar_sms,contacts,coupon,crm,crm_iap_enrich,crm_iap_mine,crm_livechat,crm_mail_plugin,crm_sms,delivery,delivery_mondialrelay,digest,event,event_booth,event_booth_sale,event_crm,event_crm_sale,event_sale,event_sms,fetchmail,fetchmail_gmail,fetchmail_outlook,fleet,gamification,gamification_sale_crm,gift_card,google_account,google_calendar,google_drive,google_gmail,google_recaptcha,google_spreadsheet,hr,hr_attendance,hr_contract,hr_expense,hr_fleet,hr_gamification,hr_holidays,hr_holidays_attendance,hr_maintenance,hr_org_chart,hr_presence,hr_recruitment,hr_recruitment_survey,hr_skills,hr_skills_slides,hr_skills_survey,hr_timesheet,hr_timesheet_attendance,hr_work_entry,hr_work_entry_contract,hr_work_entry_holidays,http_routing,iap,iap_crm,iap_mail,im_livechat,im_livechat_mail_bot,l10n_bg,l10n_gcc_invoice_stock_account,link_tracker,lunch,mail,mail_bot,mail_bot_hr,mail_group,mail_plugin,maintenance,mass_mailing,mass_mailing_crm,mass_mailing_crm_sms,mass_mailing_event,mass_mailing_event_sms,mass_mailing_event_track,mass_mailing_event_track_sms,mass_mailing_sale,mass_mailing_sale_sms,mass_mailing_slides,mass_mailing_sms,membership,microsoft_account,microsoft_calendar,microsoft_outlook,mrp,mrp_account,mrp_landed_costs,mrp_product_expiry,mrp_repair,mrp_subcontracting,mrp_subcontracting_account,mrp_subcontracting_dropshipping,mrp_subcontracting_purchase,note,partner_autocomplete,payment,payment_adyen,payment_alipay,payment_authorize,payment_buckaroo,payment_mollie,payment_ogone,payment_paypal,payment_payulatam,payment_payumoney,payment_sips,payment_stripe,payment_test,payment_transfer,phone_validation,point_of_sale,portal,portal_rating,pos_adyen,pos_cache,pos_coupon,pos_discount,pos_epson_printer,pos_epson_printer_restaurant,pos_gift_card,pos_hr,pos_mercury,pos_restaurant,pos_restaurant_adyen,pos_sale,pos_sale_margin,pos_sale_product_configurator,pos_six,product,product_email_template,product_expiry,product_images,product_margin,product_matrix,project,project_account,project_hr_expense,project_mail_plugin,project_mrp,project_purchase,project_timesheet_holidays,purchase,purchase_mrp,purchase_product_matrix,purchase_requisition,purchase_requisition_stock,purchase_requisition_stock_dropshipping,purchase_stock,rating,repair,resource,sale,sale_coupon,sale_coupon_delivery,sale_crm,sale_expense,sale_gift_card,sale_management,sale_margin,sale_mrp,sale_product_configurator,sale_product_matrix,sale_project,sale_project_account,sale_purchase,sale_purchase_stock,sale_quotation_builder,sale_sms,sale_stock,sale_stock_margin,sale_timesheet,sale_timesheet_margin,sales_team,sms,snailmail,snailmail_account,social_media,stock,stock_account,stock_dropshipping,stock_landed_costs,stock_picking_batch,stock_sms,survey,test_base_automation,test_discuss_full,test_event_full,test_mail,test_mail_full,test_mass_mailing,test_website,test_website_modules,test_website_slides_full,test_xlsx_export,theme_default,transifex,uom,utm,web,web_editor,web_kanban_gauge,web_tour,web_unsplash,website,website_blog,website_crm,website_crm_iap_reveal,website_crm_livechat,website_crm_partner_assign,website_crm_sms,website_customer,website_event,website_event_booth,website_event_booth_exhibitor,website_event_booth_sale,website_event_booth_sale_exhibitor,website_event_crm,website_event_crm_questions,website_event_exhibitor,website_event_meet,website_event_meet_quiz,website_event_questions,website_event_sale,website_event_track,website_event_track_live,website_event_track_live_quiz,website_event_track_quiz,website_form_project,website_forum,website_google_map,website_hr_recruitment,website_jitsi,website_links,website_livechat,website_mail,website_mail_group,website_mass_mailing,website_membership,website_partner,website_payment,website_profile,website_sale,website_sale_comparison,website_sale_comparison_wishlist,website_sale_coupon,website_sale_coupon_delivery,website_sale_delivery,website_sale_delivery_giftcard,website_sale_delivery_mondialrelay,website_sale_digital,website_sale_gift_card,website_sale_product_configurator,website_sale_slides,website_sale_stock,website_sale_stock_product_configurator,website_sale_stock_wishlist,website_sale_wishlist,website_slides,website_slides_forum,website_slides_survey,website_sms,website_twitter,l10n_vn_c200_pos,l10n_vn_edi_summary,l10n_vn_viin,l10n_vn_viin_account_balance_carry_forward,l10n_vn_viin_accounting_sinvoice,l10n_vn_viin_accounting_vninvoice,l10n_vn_viin_edi,l10n_vn_viin_einvoice_sale,l10n_vn_viin_hr_account,l10n_vn_viin_hr_payroll,l10n_vn_viin_hr_payroll_account,l10n_vn_viin_hr_payroll_administrative_region,l10n_vn_viin_hr_payroll_meal_account,l10n_vn_viin_picking_operation,payment_momo,payment_nganluong,payment_vnpay,payment_zalopay,test_stock_dropshipping,test_to_signup_email_verification,to_account_balance_carry_forward,to_account_counterpart,to_account_delegation_partner,to_account_payment,to_accounting_bi,to_accounting_entry_report_flag,to_affiliate,to_affiliate_sale,to_approvals,to_attendance_device,to_backdate,to_bank_currency_rate,to_bank_currency_rate_purchase_stock,to_base,to_common_uom,to_company_hotline,to_config_management,to_currency_conversion_diff,to_employee_changes_tracking,to_employee_documents,to_equipment_maintenance_schedule,to_equipment_partner_infor,to_equipment_woking_frequency,to_erponline_utility,to_event_project,to_event_timesheet,to_fee_definition,to_fee_definition_sale,to_fleet_accounting,to_fleet_accounting_fleet_operation,to_fleet_accounting_fleet_operation_revenue,to_fleet_driver,to_fleet_driver_job_wage,to_fleet_insurance_basic,to_fleet_load_params,to_fleet_operation_planning,to_fleet_specs,to_fleet_stock,to_fleet_stock_account,to_fleet_stock_picking,to_fleet_vehicle_revenue,to_fleet_vehicle_revenue_accounting,to_geo_routes,to_git,to_git_odoo_version,to_git_project,to_hr_barcode_in_emp_name,to_hr_contract_actions,to_hr_employee_advance,to_hr_employee_grade,to_hr_employee_relative,to_hr_employee_resign,to_hr_expense,to_hr_expense_employee_advance,to_hr_expense_payroll,to_hr_meal,to_hr_payroll,to_hr_payroll_account,to_hr_payroll_attendance,to_hr_payroll_meal,to_hr_project_timesheet_timeoff_payroll,to_hr_shift_rotation,to_hr_skills_recruitment,to_hr_timesheet_approval,to_hr_timesheet_payroll,to_hr_training,to_http_reroute_encoding,to_invoice_line_summary,to_invoice_tax_details,to_l10n_vn_stock_reports,to_legal_invoice_number,to_loan_management,to_loan_management_l10n_vn,to_location_warehouse,to_loyalty,to_loyalty_pos,to_loyalty_sales,to_mail_notif_and_email,to_mail_template_multilang_fix,to_maintenance_approval,to_maintenance_by_working_hours,to_maintenance_notification,to_maintenance_request_simple_mediate,to_mrp_backdate,to_mrp_bom_component_percentage,to_mrp_bom_stock_value,to_multi_company_stock_location_account,to_multi_warehouse_access_control,to_multi_warehouse_access_control_mrp,to_multi_warehouse_access_control_purchase,to_multi_warehouse_access_control_sale,to_odoo_module,to_odoo_module_sale,to_odoo_module_sale_project,to_odoo_module_sale_template,to_odoo_version,to_okr,to_okr_project,to_orderpoint_mail_thread,to_org_chart,to_partner_check_unique_vat,to_partner_dob,to_partner_dob_send_email,to_partner_equity_range,to_partner_multilang,to_partner_multilang_partner_autocomplete,to_partner_nationality,to_partner_tax_code,to_partner_track_change,to_payment_terms_extended,to_payment_transaction_protection,to_paypal_unsupported_currencies,to_payroll_payment_acb_templates,to_pos_analytics,to_pos_delivery,to_pos_frontend_return,to_pos_note,to_pos_order_to_sales_order,to_pos_refund_origin,to_procurement_approval,to_product_code_sequence,to_product_collection,to_product_collection_pos,to_product_collection_sale,to_product_dimensions,to_product_function,to_product_function_pos,to_product_function_sale,to_product_license,to_product_license_sale,to_product_maintenance_schedule,to_product_milestone,to_product_odoo_version,to_product_pricelist_weekdays,to_product_return_reason,to_product_return_reason_pos,to_product_return_reason_stock,to_product_standard_price_access,to_product_standard_price_access_account,to_product_standard_price_access_purchase,to_project_access,to_project_stages,to_promotion_voucher,to_promotion_voucher_account_payment,to_promotion_voucher_l10n_vn,to_promotion_voucher_pos,to_promotion_voucher_pos_return,to_promotion_voucher_pos_sale,to_promotion_voucher_sale,to_purchase_backdate,to_purchase_bom_stock_value,to_purchase_landed_cost,to_purchase_line_numbering,to_purchase_order_advance,to_refund_account,to_registration_email_blacklist,to_repair_access_group,to_repair_request_from_maintenance,to_repair_request_from_warranty,to_repair_supply,to_repair_timesheet,to_repair_with_maintenance_schedule,to_safe_confirm_button,to_sale_backdate,to_sale_desc_short_link,to_sale_line_numbering,to_sale_order_advance,to_sale_price_lock,to_sale_purchase_multi_comp,to_sale_wallet,to_sales_stock_schedule,to_sales_target,to_sales_target_pos,to_sales_target_sale,to_sales_team_advanced,to_sales_team_advanced_crm,to_sales_team_advanced_sale,to_signup_email_verification,to_sshkey,to_stock_account_moves_link,to_stock_age_report,to_stock_backdate,to_stock_block_quantity,to_stock_equipment,to_stock_equipment_bom_kit,to_stock_equipment_hierarchy,to_stock_picking_backdate,to_stock_product_allocation_approval,to_stock_production_lot_partner_infor,to_stock_report_common,to_tax_is_vat,to_token_expiration,to_token_expiration_test,to_unique_product_code,to_uom_mail_thread,to_uom_subscription,to_upload_file,to_vat_counterpart,to_vendor_price_lock,to_vietnam_bank_icons,to_vietnamese_number2words,to_wallet,to_wallet_adjustment,to_wallet_currency_conversion_diff,to_warranty_management,to_warranty_purchase,to_warranty_purchase_stock,to_warranty_sale,to_warranty_sale_stock,to_warranty_stock,to_web_thousand_sep,to_website_affiliate,to_website_apps_store,to_website_base,to_website_docs,to_website_docs_odoo,to_website_docs_odoo_data,to_website_odoo_version,to_website_recaptcha,to_website_recaptcha_signup,to_website_slides_event,to_zoom_calendar,viin_account,viin_account_bank_statement_import,viin_account_bank_statement_import_rje,viin_account_reconciliation,viin_account_regenerate_analytic_line,viin_administrative_region,viin_affiliate_crm,viin_affiliate_sale_crm,viin_affiliate_website_crm_livechat,viin_affiliate_website_project,viin_base_district,viin_base_state_group,viin_contacts_district,viin_crm_business_nature,viin_crm_customer_recognition,viin_crm_dob,viin_fee_definition_sale_project,viin_fleet,viin_fleet_accounting_purchase,viin_fleet_vehicle_revenue_accounting_sale,viin_foreign_trade,viin_foreign_trade_currency_rate,viin_helpdesk,viin_helpdesk_crm,viin_helpdesk_livechat,viin_helpdesk_sale,viin_helpdesk_severity,viin_helpdesk_timesheet,viin_hr,viin_hr_account,viin_hr_activity_planning,viin_hr_assignment_log,viin_hr_attendance_validation,viin_hr_contract,viin_hr_employee_birthday,viin_hr_employee_relative_birthdate,viin_hr_employee_resource_calendar,viin_hr_holidays,viin_hr_maintenance,viin_hr_overtime,viin_hr_overtime_approval,viin_hr_overtime_approval_payroll,viin_hr_overtime_attendance,viin_hr_overtime_payroll,viin_hr_overtime_timesheet,viin_hr_overtime_timesheet_approval,viin_hr_overtime_timesheet_attendance,viin_hr_payroll_administrative_region,viin_hr_payroll_timesheet_wfh,viin_hr_project,viin_hr_rank,viin_hr_recruitment,viin_hr_recruitment_approval,viin_hr_role,viin_hr_seniority,viin_hr_skill_framework,viin_hr_skill_framework_recruitment,viin_hr_timesheet_timer,viin_inventory_adjustment_with_cost_price,viin_l10n_vn_account_payment_internal_transfer,viin_l10n_vn_accounting_vninvoice_summary,viin_l10n_vn_foreign_trade,viin_l10n_vn_hr_payroll_account_overtime,viin_l10n_vn_stock_reports_multi_warehouse_access_control,viin_l10n_vn_vat_counterpart,viin_mail_search,viin_mail_show_recipient,viin_maintenance,viin_maintenance_preventive_mode,viin_maintenance_tracking,viin_maintenance_unlink,viin_meeting_room,viin_message_edit_lock,viin_multi_warehouse_access_control_purchase_requisition,viin_partner_business_nature,viin_partner_country_recognition,viin_partner_filter,viin_partner_gender,viin_partner_shareholder,viin_pricelist_recurring,viin_product_categ_mail_thread,viin_product_categ_mail_thread_purchase,viin_product_categ_mail_thread_stock_account,viin_project_access_timesheet,viin_project_kanban_state_notification,viin_project_timesheet_leave,viin_purchase,viin_queue,viin_repair,viin_repair_discount,viin_resource_calendar_rate,viin_reverse_move_line,viin_sale_crm_follower_access_right,viin_sale_product_duplication_warning,viin_sale_project,viin_sale_project_technician,viin_sale_quotation_template_access,viin_sales_unlink,viin_sales_unlink_stock,viin_social,viin_social_facebook,viin_social_facebook_verify,viin_social_lead,viin_social_linkedin,viin_stock_internal_transit_valuation,viin_stock_internal_transit_valuation_specific_identification,viin_stock_specific_identification,viin_stock_specific_identification_landed_costs,viin_survey_exam,viin_survey_recompute_results,viin_unicode_slugify,viin_user_assignment_log,viin_user_assignment_log_project,viin_web_countup_timer,viin_website_blog_access_right,viin_website_forum_security_groups,viin_website_gtm,viin_website_helpdesk,viin_website_hr_recruitment_website_editor,viin_website_livechat,viin_website_multilingual_multimedia,viin_website_nofollow,viin_website_page_access_right,viin_website_partner_business_nature,l10n_vn_viin_account_asset,l10n_vn_viin_account_asset_sale,l10n_vn_viin_account_reports,to_account_accountant,to_account_asset,to_account_asset_purchase,to_account_budget,to_account_budget_hr_timesheet,to_account_reports,to_account_reports_report_off,to_cost_revenue_deferred,to_hide_ent_modules,to_hide_ent_modules_website_theme,to_inter_company_base,to_inter_company_invoice,to_inter_company_sale_purchase,to_inter_company_sale_purchase_stock,to_mrp_account,to_mrp_barcode,to_mrp_maintenance,to_mrp_mps,to_mrp_plm,to_mrp_workorder,to_purchase_receipt,to_quality,to_quality_mrp,to_quality_stock,to_sale_subscription,to_stock_asset,to_stock_asset_equipment,to_stock_barcode,viin_account_subscription,viin_auto_currency_rate,viin_auto_currency_rate_acb,viin_auto_currency_rate_vcb,viin_contacts_map,viin_crm,viin_document,viin_document_account,viin_document_hr,viin_document_hr_contract,viin_document_hr_payroll,viin_document_hr_recruitment,viin_document_mrp,viin_document_project,viin_document_purchase,viin_document_sale,viin_document_stock,viin_employee_map,viin_features_activate_account,viin_features_activate_contacts,viin_features_activate_hr,viin_features_activate_hr_attendance,viin_features_activate_hr_expense,viin_features_activate_hr_payroll,viin_features_activate_hr_recruitment,viin_features_activate_product,viin_features_activate_project,viin_features_activate_purchase,viin_features_activate_sale,viin_features_activate_stock,viin_features_activate_survey,viin_features_activate_website,viin_hide_ent_modules_account,viin_hide_ent_modules_event,viin_hide_ent_modules_expense,viin_hide_ent_modules_hr_timesheet,viin_hide_ent_modules_inter_company,viin_hide_ent_modules_mrp,viin_hide_ent_modules_point_of_sale,viin_hide_ent_modules_project,viin_hide_ent_modules_purchase,viin_hide_ent_modules_sale,viin_hide_ent_modules_sale_timesheet,viin_hide_ent_modules_stock,viin_hide_ent_modules_website,viin_mobile,viin_mobile_firebase,viin_mobile_messenger,viin_mrp_barcode_backdate,viin_quality_product,viin_sale,viin_sale_crm,viin_stock,viin_web_cohort,viin_web_dashboard,viin_web_map,viin_website,viin_website_image_optimization_disable,viin_website_seo,viin_website_seo_blog,viin_website_seo_hr_recruitment,viin_fleet_operation_planning_gantt,viin_mrp_gantt,viin_project_gantt,viin_web_gantt,to_backend_theme,web_responsive,viin_brand,viin_brand_account,viin_brand_auth_oauth,viin_brand_auth_totp,viin_brand_auth_totp_mail_enforce,viin_brand_base_import,viin_brand_base_setup,viin_brand_common,viin_brand_crm,viin_brand_digest,viin_brand_hr_expense,viin_brand_iap,viin_brand_im_livechat,viin_brand_mail,viin_brand_mail_bot,viin_brand_mass_mailing,viin_brand_mass_mailing_crm,viin_brand_mass_mailing_sale,viin_brand_mrp,viin_brand_payment,viin_brand_payment_authorize,viin_brand_payment_paypal,viin_brand_pos,viin_brand_pos_mercury,viin_brand_product,viin_brand_purchase,viin_brand_purchase_stock,viin_brand_sale,viin_brand_sale_management,viin_brand_sale_quotation_builder,viin_brand_sale_stock,viin_brand_stock,viin_brand_stock_account,viin_brand_web_editor,viin_brand_web_unsplash,viin_brand_website,viin_brand_website_blog,viin_brand_website_event,viin_brand_website_event_exhibitor,viin_brand_website_forum,viin_brand_website_links,viin_brand_website_livechat,viin_brand_website_profile,viin_brand_website_sale,viin_brand_website_slides
09/22/2022 23:03:53 INFO
Finished step: Test at install odoo 15.0 in 57m 30.12s
09/22/2022 23:03:53 INFO
Running step: Test post install odoo 15.0
09/22/2022 23:03:54 INFO
Run command: exec_odoo args: --log-level=warn --max-cron-threads=0 --workers=0 --test-enable --test-tags=-at_install,-.test_assign_perf_duplicates,-.test_assign_perf_no_duplicates,-.test_assign_perf_populated,-/web:WebSuite.test_js,-:TestIsMultiLang.test_02_url_lang_code_underscore,-:TestUi.test_01_main_flow_tour,-:WebSuite.test_check_suite,-:TestTermCount.test_export_empty_string,-:TestLifoPrice.test_lifoprice,-:BuckarooTest.test_redirect_form_values,-:SipsTest.test_redirect_form_values,-pad,-pad_project
09/22/2022 23:15:50 WARNING
Chrome executable not found
09/22/2022 23:23:11 WARNING
Chrome executable not found
09/22/2022 23:26:04 WARNING
Chrome executable not found
09/22/2022 23:26:04 WARNING
Chrome executable not found
09/22/2022 23:26:04 WARNING
Chrome executable not found
09/22/2022 23:26:04 WARNING
Chrome executable not found
09/22/2022 23:26:04 WARNING
Chrome executable not found
09/22/2022 23:26:04 WARNING
Chrome executable not found
09/22/2022 23:26:04 WARNING
Chrome executable not found
09/22/2022 23:26:04 WARNING
Chrome executable not found
09/22/2022 23:26:04 WARNING
Chrome executable not found
09/22/2022 23:26:04 WARNING
Chrome executable not found
09/22/2022 23:26:08 WARNING
Chrome executable not found
09/22/2022 23:26:08 WARNING
Chrome executable not found
09/22/2022 23:26:22 WARNING
Chrome executable not found
09/22/2022 23:26:49 WARNING
Chrome executable not found
09/22/2022 23:26:49 WARNING
Chrome executable not found
09/22/2022 23:26:49 WARNING
Chrome executable not found
09/22/2022 23:26:49 WARNING
Chrome executable not found
09/22/2022 23:26:50 WARNING
Chrome executable not found
09/22/2022 23:27:54 WARNING
Chrome executable not found
09/22/2022 23:29:49 WARNING
Chrome executable not found
09/23/2022 03:24:06 WARNING
Chrome executable not found
09/23/2022 03:24:06 WARNING
Chrome executable not found
09/23/2022 03:24:06 WARNING
Chrome executable not found
09/23/2022 03:24:06 WARNING
Chrome executable not found
09/23/2022 03:24:06 WARNING
Chrome executable not found
09/23/2022 03:24:11 WARNING
Chrome executable not found
09/23/2022 03:24:11 WARNING
Chrome executable not found
09/23/2022 03:33:41 WARNING
Chrome executable not found
09/23/2022 03:33:41 WARNING
Chrome executable not found
09/23/2022 03:33:41 WARNING
Chrome executable not found
09/23/2022 03:33:41 WARNING
Chrome executable not found
09/23/2022 03:33:41 WARNING
Chrome executable not found
09/23/2022 03:33:41 WARNING
Chrome executable not found
09/23/2022 03:34:24 WARNING
Chrome executable not found
09/23/2022 03:41:42 WARNING
Chrome executable not found
09/23/2022 03:42:04 WARNING
Chrome executable not found
09/23/2022 03:42:06 WARNING
Chrome executable not found
09/23/2022 03:42:28 WARNING
Chrome executable not found
09/23/2022 03:42:29 WARNING
Chrome executable not found
09/23/2022 03:42:30 WARNING
Chrome executable not found
09/23/2022 03:42:31 WARNING
Chrome executable not found
09/23/2022 03:42:31 WARNING
Chrome executable not found
09/23/2022 03:44:11 WARNING
Chrome executable not found
09/23/2022 03:44:15 WARNING
Chrome executable not found
09/23/2022 03:44:15 WARNING
Chrome executable not found
09/23/2022 03:44:34 WARNING
Chrome executable not found
09/23/2022 03:44:38 WARNING
Chrome executable not found
09/23/2022 03:48:42 WARNING
Chrome executable not found
09/23/2022 03:57:39 WARNING
Chrome executable not found
09/23/2022 04:01:21 WARNING
Chrome executable not found
09/23/2022 04:03:42 WARNING
Chrome executable not found
09/23/2022 04:03:43 WARNING
Chrome executable not found
09/23/2022 04:03:43 WARNING
Chrome executable not found
09/23/2022 04:03:43 WARNING
Chrome executable not found
09/23/2022 04:03:43 WARNING
Chrome executable not found
09/23/2022 04:03:43 WARNING
Chrome executable not found
09/23/2022 04:03:43 WARNING
Chrome executable not found
09/23/2022 04:17:30 WARNING
Chrome executable not found
09/23/2022 04:18:25 WARNING
Chrome executable not found
09/23/2022 04:23:42 WARNING
Chrome executable not found
09/23/2022 04:23:42 WARNING
Chrome executable not found
09/23/2022 04:23:43 WARNING
Chrome executable not found
09/23/2022 04:23:43 WARNING
Chrome executable not found
09/23/2022 04:23:43 WARNING
Chrome executable not found
09/23/2022 04:23:43 WARNING
Chrome executable not found
09/23/2022 04:23:43 WARNING
Chrome executable not found
09/23/2022 04:23:43 WARNING
Chrome executable not found
09/23/2022 04:23:43 WARNING
Chrome executable not found
09/23/2022 04:23:43 WARNING
Chrome executable not found
09/23/2022 04:24:03 WARNING
Chrome executable not found
09/23/2022 04:24:26 ERROR
ERROR: Subtest TestMailAPIPerformance.test_message_assignation_email (login='__system__')
Traceback (most recent call last):
File "/opt/odoo/15.0/odoo/api.py", line 886, in get
return field_cache[record._ids[0]]
KeyError: 2515

During handling of the above exception, another exception occurred:

Traceback (most recent call last):
File "/opt/odoo/15.0/odoo/fields.py", line 1057, in __get__
value = env.cache.get(record, self)
File "/opt/odoo/15.0/odoo/api.py", line 889, in get
raise CacheMiss(record, field)
odoo.exceptions.CacheMiss: 'res.users(2515,).company_id'

During handling of the above exception, another exception occurred:

Traceback (most recent call last):
File "/opt/odoo/15.0/odoo/tests/common.py", line 1669, in wrapper
func(*args, **kwargs)
File "<decorator-gen-512>", line 2, in test_message_assignation_email
File "/opt/odoo/15.0/odoo/tests/common.py", line 1692, in warmup
func(*args, **kwargs)
File "/opt/odoo/15.0/addons/test_mail/tests/test_performance.py", line 341, in test_message_assignation_email
with self.assertQueryCount(__system__=41, emp=42): # tm 38/39
File "/usr/lib/python3.8/contextlib.py", line 113, in __enter__
return next(self.gen)
File "/opt/odoo/15.0/odoo/tests/common.py", line 529, in assertQueryCount
self.env.cr.flush()
File "/opt/odoo/15.0/odoo/sql_db.py", line 110, in flush
self.precommit.run()
File "/opt/odoo/15.0/odoo/tools/misc.py", line 1145, in run
func()
File "/opt/odoo/15.0/addons/mail/models/mail_thread.py", line 544, in _finalize_tracking
tracking = records.with_context(context).message_track(fnames, initial_values)
File "/opt/odoo/15.0/addons/mail/models/mail_thread.py", line 601, in message_track
tracked_fields = self.fields_get(tracked_fields)
File "/opt/odoo/15.0/odoo/models.py", line 3094, in fields_get
description = field.get_description(self.env)
File "/opt/odoo/15.0/odoo/fields.py", line 749, in get_description
value = value(env)
File "/opt/odoo/15.0/odoo/fields.py", line 2651, in _description_domain
return self.domain(env[self.model_name]) if callable(self.domain) else self.domain
File "/opt/odoo/15.0/addons/product/models/res_partner.py", line 15, in <lambda>
domain=lambda self: [('company_id', 'in', (self.env.company.id, False))],
File "/opt/odoo/15.0/odoo/tools/func.py", line 26, in __get__
value = self.fget(obj)
File "/opt/odoo/15.0/odoo/api.py", line 640, in company
return self.user.company_id.with_env(self)
File "/opt/odoo/15.0/odoo/fields.py", line 2603, in __get__
return super().__get__(records, owner)
File "/opt/odoo/15.0/odoo/fields.py", line 1087, in __get__
raise MissingError("\n".join([
odoo.exceptions.MissingError: Record does not exist or has been deleted.
(Record: res.users(2515,), User: 2515)
09/23/2022 04:24:48 WARNING
Chrome executable not found
09/23/2022 04:24:48 WARNING
Chrome executable not found
09/23/2022 04:25:26 WARNING
Chrome executable not found
09/23/2022 04:25:26 WARNING
Chrome executable not found
09/23/2022 04:27:56 WARNING
Chrome executable not found
09/23/2022 04:27:56 WARNING
Chrome executable not found
09/23/2022 04:27:59 WARNING
Chrome executable not found
09/23/2022 04:27:59 WARNING
Chrome executable not found
09/23/2022 04:27:59 WARNING
Chrome executable not found
09/23/2022 04:27:59 WARNING
Chrome executable not found
09/23/2022 04:28:24 WARNING
Chrome executable not found
09/23/2022 04:28:28 WARNING
Chrome executable not found
09/23/2022 04:28:28 WARNING
Chrome executable not found
09/23/2022 04:28:29 WARNING
Chrome executable not found
09/23/2022 04:53:46 ERROR
FAIL: TestPriceLock.test_change_price_unit
Traceback (most recent call last):
File "/home/mug7nipybin4-125778/build_src/to_sale_price_lock/tests/test_price_lock.py", line 25, in test_change_price_unit
self.assertNotIn(self.env.company.sales_price_modifying_group_id, self.user_demo.groups_id)
AssertionError: res.groups(119,) unexpectedly found in res.groups(11, 7, 160, 244, 221, 135, 175, 130, 107, 238, 158, 113, 159, 121, 8, 112, 1, 125, 139, 101, 185, 181, 99, 116, 188, 126, 4, 5, 215, 138, 108, 211, 168, 263, 202, 127, 141, 253, 150, 213, 140, 103, 231, 156, 210, 201, 6, 132, 131, 179, 176, 180, 241, 170, 110, 106, 174, 151, 222, 228, 235, 237, 183, 134, 119, 256, 118, 255, 220, 219, 261)
09/23/2022 04:53:47 ERROR
FAIL: TestPriceLock.test_change_price_unit_2
Traceback (most recent call last):
File "/home/mug7nipybin4-125778/build_src/to_sale_price_lock/tests/test_price_lock.py", line 66, in test_change_price_unit_2
order_line.with_user(self.user_demo).write({'price_unit': 100})
File "/usr/lib/python3.8/contextlib.py", line 120, in __exit__
next(self.gen)
File "/opt/odoo/15.0/odoo/tests/common.py", line 436, in _assertRaises
yield cm
File "/usr/lib/python3.8/contextlib.py", line 525, in __exit__
raise exc_details[1]
File "/usr/lib/python3.8/contextlib.py", line 510, in __exit__
if cb(*exc_details):
AssertionError: UserError not raised
09/23/2022 04:53:47 ERROR
FAIL: TestPriceLock.test_change_uom
Traceback (most recent call last):
File "/home/mug7nipybin4-125778/build_src/to_sale_price_lock/tests/test_price_lock.py", line 33, in test_change_uom
self.assertNotIn(self.env.company.sales_price_modifying_group_id, self.user_demo.groups_id)
AssertionError: res.groups(119,) unexpectedly found in res.groups(11, 7, 160, 244, 221, 135, 175, 130, 107, 238, 158, 113, 159, 121, 8, 112, 1, 125, 139, 101, 185, 181, 99, 116, 188, 126, 4, 5, 215, 138, 108, 211, 168, 263, 202, 127, 141, 253, 150, 213, 140, 103, 231, 156, 210, 201, 6, 132, 131, 179, 176, 180, 241, 170, 110, 106, 174, 151, 222, 228, 235, 237, 183, 134, 119, 256, 118, 255, 220, 219, 261)
09/23/2022 04:53:47 ERROR
FAIL: TestPriceLock.test_change_uom_and_price
Traceback (most recent call last):
File "/home/mug7nipybin4-125778/build_src/to_sale_price_lock/tests/test_price_lock.py", line 45, in test_change_uom_and_price
self.assertNotIn(self.env.company.sales_price_modifying_group_id, self.user_demo.groups_id)
AssertionError: res.groups(119,) unexpectedly found in res.groups(11, 7, 160, 244, 221, 135, 175, 130, 107, 238, 158, 113, 159, 121, 8, 112, 1, 125, 139, 101, 185, 181, 99, 116, 188, 126, 4, 5, 215, 138, 108, 211, 168, 263, 202, 127, 141, 253, 150, 213, 140, 103, 231, 156, 210, 201, 6, 132, 131, 179, 176, 180, 241, 170, 110, 106, 174, 151, 222, 228, 235, 237, 183, 134, 119, 256, 118, 255, 220, 219, 261)
09/23/2022 05:01:43 WARNING
You may not be able to rate an app that you did not buy.
09/23/2022 05:01:45 WARNING
You may not be able to rate an app that you did not buy.
09/23/2022 05:20:46 WARNING
Chrome executable not found
09/23/2022 05:20:46 WARNING
Chrome executable not found
09/23/2022 05:20:48 WARNING
Chrome executable not found
09/23/2022 05:21:02 WARNING
Chrome executable not found
09/23/2022 05:21:03 WARNING
Chrome executable not found
09/23/2022 05:21:39 WARNING
Chrome executable not found
09/23/2022 05:50:33 WARNING
Chrome executable not found
09/23/2022 05:50:34 WARNING
Chrome executable not found
09/23/2022 05:50:35 WARNING
Chrome executable not found
09/23/2022 05:50:35 WARNING
Chrome executable not found
09/23/2022 05:50:35 WARNING
Chrome executable not found
09/23/2022 05:50:38 WARNING
Chrome executable not found
09/23/2022 05:50:38 WARNING
Chrome executable not found
09/23/2022 05:50:38 WARNING
Chrome executable not found
09/23/2022 05:50:38 WARNING
Chrome executable not found
09/23/2022 05:50:39 WARNING
Chrome executable not found
09/23/2022 05:50:39 WARNING
Chrome executable not found
09/23/2022 05:50:39 WARNING
Chrome executable not found
09/23/2022 05:50:39 WARNING
Chrome executable not found
09/23/2022 05:50:39 WARNING
Chrome executable not found
09/23/2022 05:50:39 WARNING
Chrome executable not found
09/23/2022 05:50:39 WARNING
Chrome executable not found
09/23/2022 05:50:39 WARNING
Chrome executable not found
09/23/2022 05:50:39 WARNING
Chrome executable not found
09/23/2022 05:50:39 WARNING
Chrome executable not found
09/23/2022 05:50:39 WARNING
Chrome executable not found
09/23/2022 05:50:39 WARNING
Chrome executable not found
09/23/2022 05:50:39 WARNING
Chrome executable not found
09/23/2022 05:50:39 WARNING
Chrome executable not found
09/23/2022 05:50:39 WARNING
Chrome executable not found
09/23/2022 05:50:39 WARNING
Chrome executable not found
09/23/2022 05:50:40 WARNING
Chrome executable not found
09/23/2022 05:50:40 WARNING
Chrome executable not found
09/23/2022 05:51:01 WARNING
Chrome executable not found
09/23/2022 05:51:01 WARNING
Chrome executable not found
09/23/2022 05:51:01 WARNING
Chrome executable not found
09/23/2022 05:51:02 WARNING
Chrome executable not found
09/23/2022 05:51:13 WARNING
Chrome executable not found
09/23/2022 05:51:13 WARNING
Chrome executable not found
09/23/2022 05:51:13 WARNING
Chrome executable not found
09/23/2022 05:51:17 WARNING
Chrome executable not found
09/23/2022 05:51:45 WARNING
Chrome executable not found
09/23/2022 05:51:45 WARNING
Chrome executable not found
09/23/2022 05:51:51 WARNING
Chrome executable not found
09/23/2022 05:51:52 WARNING
Chrome executable not found
09/23/2022 05:51:53 WARNING
Chrome executable not found
09/23/2022 05:51:53 WARNING
Chrome executable not found
09/23/2022 05:51:58 WARNING
Chrome executable not found
09/23/2022 05:51:59 WARNING
Chrome executable not found
09/23/2022 05:51:59 WARNING
Chrome executable not found
09/23/2022 05:51:59 WARNING
Chrome executable not found
09/23/2022 05:52:08 WARNING
Chrome executable not found
09/23/2022 05:52:09 WARNING
Chrome executable not found
09/23/2022 05:52:09 WARNING
Chrome executable not found
09/23/2022 05:52:09 WARNING
Chrome executable not found
09/23/2022 05:52:10 WARNING
Chrome executable not found
09/23/2022 05:52:10 WARNING
Chrome executable not found
09/23/2022 05:52:10 WARNING
Chrome executable not found
09/23/2022 05:52:11 WARNING
Chrome executable not found
09/23/2022 05:52:11 WARNING
Chrome executable not found
09/23/2022 05:52:11 WARNING
Chrome executable not found
09/23/2022 05:52:12 WARNING
Chrome executable not found
09/23/2022 05:52:13 WARNING
Chrome executable not found
09/23/2022 05:52:14 WARNING
Chrome executable not found
09/23/2022 05:52:15 WARNING
Chrome executable not found
09/23/2022 05:52:16 WARNING
Chrome executable not found
09/23/2022 05:52:18 WARNING
Chrome executable not found
09/23/2022 05:52:19 WARNING
Chrome executable not found
09/23/2022 05:52:20 WARNING
Chrome executable not found
09/23/2022 05:52:21 WARNING
Chrome executable not found
09/23/2022 05:52:22 WARNING
Chrome executable not found
09/23/2022 05:52:24 WARNING
Chrome executable not found
09/23/2022 05:52:25 WARNING
Chrome executable not found
09/23/2022 05:52:51 WARNING
Chrome executable not found
09/23/2022 05:52:54 WARNING
Chrome executable not found
09/23/2022 05:52:55 WARNING
Chrome executable not found
09/23/2022 05:53:28 WARNING
Chrome executable not found
09/23/2022 05:57:17 WARNING
Chrome executable not found
09/23/2022 05:57:40 WARNING
Chrome executable not found
09/23/2022 05:57:40 WARNING
Chrome executable not found
09/23/2022 05:57:42 WARNING
Chrome executable not found
09/23/2022 05:57:49 WARNING
Chrome executable not found
09/23/2022 05:57:49 WARNING
Chrome executable not found
09/23/2022 05:57:50 WARNING
Chrome executable not found
09/23/2022 05:57:51 WARNING
Chrome executable not found
09/23/2022 05:57:51 WARNING
Chrome executable not found
09/23/2022 05:57:52 WARNING
Chrome executable not found
09/23/2022 05:57:52 ERROR
4 failed, 1 error(s) of 4197 tests when loading database 'mug7nipybin4-125778_db'
09/23/2022 05:57:57 ERROR
Odoo command execution ended with error
09/23/2022 05:58:01 INFO
Finished step: Test post install odoo 15.0 in 6h 54m
09/23/2022 13:02:35 INFO
Revoking Proxy
09/23/2022 13:02:35 INFO
Revoked Proxy
09/23/2022 13:02:36 INFO
Revoking DNS
09/23/2022 13:02:37 INFO
Revoked DNS
09/23/2022 13:02:37 INFO
Revoking backend
09/23/2022 13:02:39 INFO
Revoked backend
09/23/2022 13:02:40 INFO
Revoking database
09/23/2022 13:02:41 INFO
Revoked database
09/23/2022 13:02:41 INFO
Marked as unlink
09/23/2022 13:02:41 INFO
Revoked Build