| Subbuilds | Name | State | Detail |
|---|---|---|---|
| Build 423695 | At install tests: from account to website_timesheet 107m | Succeed | Log |
| Build 423696 | Post install tests: step install all modules 16m | Succeed | Log |
| Build 423697 | Post install tests: from account to hr_recruitment_survey 140m | Failed | Log |
| Build 423698 | Post install tests: from hr_skills to phone_validation 140m | Succeed | Log |
| Build 423699 | Post install tests: from point_of_sale to purchase_requisition_stock 185m | Succeed | Log |
| Build 423700 | Post install tests: from purchase_stock to test_l10n_vn_viin_edi 125m | Succeed | Log |
| Build 423701 | Post install tests: from test_mail to to_product_return_reason_stock 160m | Failed | Log |
| Build 423702 | Post install tests: from to_registration_email_blacklist to viin_approval_purpose_routing 125m | Succeed | Log |
| Build 423703 | Post install tests: from viin_approval_sale to viin_product 145m | Failed | Log |
| Build 423704 | Post install tests: from viin_project to web_unsplash 109m | Failed | Log |
| Build 423705 | Post install tests: from website to website_timesheet 115m | Failed | Log |
| Create Date | Level | Message |
|---|---|---|
| 10/11/2026 22:55:00 | INFO |
Updated repository Viindoo-tvtmaaddons
|
| 10/11/2026 22:55:00 | INFO |
Updated repository Viindoo-erponline-enterprise
|
| 10/11/2026 22:55:00 | INFO |
Updated repository Viindoo-branding
|
| 10/11/2026 22:55:00 | INFO |
Cloned repository Viindoo-odoo
|
| 10/12/2026 01:35:06 | ERROR |
Subbuild # 423697:
odoo.addons.account.tests.test_account_account: FAIL: TestAccountAccount.test_compute_account_type_on_code_change
Traceback (most recent call last):
File "/data/build/rb-12f368c-225484/addons/account/tests/test_account_account.py", line 403, in test_compute_account_type_on_code_change
self.assertTrue(account_form.reconcile)
^^^^^^^^^^^^^^^^^^^^^^
File "/data/build/rb-12f368c-225484/odoo/tests/form.py", line 345, in __getattr__
return self[field_name]
~~~~^^^^^^^^^^^^
File "/data/build/rb-12f368c-225484/odoo/tests/form.py", line 350, in __getitem__
assert field_info is not None, f"{field_name!r} was not found in the view"
^^^^^^^^^^^^^^^^^^^^^^
AssertionError: 'reconcile' was not found in the view
|
| 10/12/2026 01:35:06 | ERROR |
Subbuild # 423697:
odoo.tests.result: 1 failed, 0 error(s) of 2335 tests when loading database 'rb-12f368c-225484-423697'
|
| 10/12/2026 02:20:04 | WARNING |
Subbuild # 423699:
odoo.http: You can only cancel a session that is in opening control state and has no orders.
|
| 10/12/2026 02:20:04 | WARNING |
Subbuild # 423699:
odoo.http: You can only cancel a session that is in opening control state and has no orders.
|
| 10/12/2026 02:20:04 | WARNING |
Subbuild # 423699:
odoo.http: You can only cancel a session that is in opening control state and has no orders.
|
| 10/12/2026 02:20:04 | WARNING |
Subbuild # 423699:
odoo.http: You can only cancel a session that is in opening control state and has no orders.
|
| 10/12/2026 01:55:43 | ERROR |
Subbuild # 423701:
odoo.addons.test_main_flows.tests.test_flow.TestUi.test_01_main_flow_tour.browser: FAILED: [153/306] Tour main_flow_tour → Step .ui-menu-item > a:contains('the_flow.product').
Element (.ui-menu-item > a:contains('the_flow.product')) has not been found.
TIMEOUT step failed to complete within 10000 ms.
|
| 10/12/2026 01:55:43 | ERROR |
Subbuild # 423701:
odoo.addons.test_main_flows.tests.test_flow: FAIL: TestUi.test_01_main_flow_tour
Traceback (most recent call last):
File "/data/build/rb-12f368c-225484/odoo/addons/test_main_flows/tests/test_flow.py", line 107, in test_01_main_flow_tour
self.main_flow_tour()
File "/data/build/rb-12f368c-225484/odoo/addons/test_main_flows/tests/test_flow.py", line 100, in main_flow_tour
self.start_tour("/odoo", 'main_flow_tour', login="admin", timeout=180)
File "/data/build/rb-12f368c-225484/addons/account/tests/common.py", line 1656, in start_tour
super().start_tour(url_path, tour_name, **kwargs)
File "/data/build/rb-12f368c-225484/odoo/tests/common.py", line 2612, in start_tour
self.browser_js(url_path=url_path, code=code, ready=ready, timeout=timeout, success_signal="tour succeeded", **kwargs)
File "/data/build/rb-12f368c-225484/odoo/tests/common.py", line 2582, in browser_js
self.fail('%s\n\n%s' % (message, error))
AssertionError: The test code "odoo.startTour('main_flow_tour', {"stepDelay": 0, "keepWatchBrowser": false, "debug": false, "startUrl": "/odoo", "delayToCheckUndeterminisms": 0})" failed
FAILED: [153/306] Tour main_flow_tour → Step .ui-menu-item > a:contains('the_flow.product').
Element (.ui-menu-item > a:contains('the_flow.product')) has not been found.
TIMEOUT step failed to complete within 10000 ms.
|
| 10/12/2026 01:55:43 | ERROR |
Subbuild # 423701:
odoo.addons.test_sale_product_configurators.tests.test_sale_product_configurator.TestProductConfiguratorUi.test_01_product_configurator.browser: FAILED: [11/32] Tour sale_product_configurator_tour → Step ul.ui-autocomplete a:contains("Customizable Desk (TEST)").
Element (ul.ui-autocomplete a:contains("Customizable Desk (TEST)")) has not been found.
TIMEOUT step failed to complete within 10000 ms.
|
| 10/12/2026 01:55:43 | ERROR |
Subbuild # 423701:
odoo.addons.test_sale_product_configurators.tests.test_sale_product_configurator: FAIL: TestProductConfiguratorUi.test_01_product_configurator
Traceback (most recent call last):
File "/data/build/rb-12f368c-225484/addons/test_sale_product_configurators/tests/test_sale_product_configurator.py", line 37, in test_01_product_configurator
self.start_tour("/odoo", 'sale_product_configurator_tour', login='salesman')
File "/data/build/rb-12f368c-225484/odoo/tests/common.py", line 2612, in start_tour
self.browser_js(url_path=url_path, code=code, ready=ready, timeout=timeout, success_signal="tour succeeded", **kwargs)
File "/data/build/rb-12f368c-225484/odoo/tests/common.py", line 2582, in browser_js
self.fail('%s\n\n%s' % (message, error))
AssertionError: The test code "odoo.startTour('sale_product_configurator_tour', {"stepDelay": 0, "keepWatchBrowser": false, "debug": false, "startUrl": "/odoo", "delayToCheckUndeterminisms": 0})" failed
FAILED: [11/32] Tour sale_product_configurator_tour → Step ul.ui-autocomplete a:contains("Customizable Desk (TEST)").
Element (ul.ui-autocomplete a:contains("Customizable Desk (TEST)")) has not been found.
TIMEOUT step failed to complete within 10000 ms.
|
| 10/12/2026 01:55:43 | ERROR |
Subbuild # 423701:
odoo.addons.test_sale_product_configurators.tests.test_sale_product_configurator.TestProductConfiguratorUi.test_02_product_configurator_advanced.browser: FAILED: [12/28] Tour sale_product_configurator_advanced_tour → Step ul.ui-autocomplete a:contains("Customizable Desk (TEST)").
Element (ul.ui-autocomplete a:contains("Customizable Desk (TEST)")) has not been found.
TIMEOUT step failed to complete within 10000 ms.
|
| 10/12/2026 01:55:43 | ERROR |
Subbuild # 423701:
odoo.addons.test_sale_product_configurators.tests.test_sale_product_configurator: FAIL: TestProductConfiguratorUi.test_02_product_configurator_advanced
Traceback (most recent call last):
File "/data/build/rb-12f368c-225484/addons/test_sale_product_configurators/tests/test_sale_product_configurator.py", line 105, in test_02_product_configurator_advanced
self.start_tour("/odoo", 'sale_product_configurator_advanced_tour', login='salesman')
File "/data/build/rb-12f368c-225484/odoo/tests/common.py", line 2612, in start_tour
self.browser_js(url_path=url_path, code=code, ready=ready, timeout=timeout, success_signal="tour succeeded", **kwargs)
File "/data/build/rb-12f368c-225484/odoo/tests/common.py", line 2582, in browser_js
self.fail('%s\n\n%s' % (message, error))
AssertionError: The test code "odoo.startTour('sale_product_configurator_advanced_tour', {"stepDelay": 0, "keepWatchBrowser": false, "debug": false, "startUrl": "/odoo", "delayToCheckUndeterminisms": 0})" failed
FAILED: [12/28] Tour sale_product_configurator_advanced_tour → Step ul.ui-autocomplete a:contains("Customizable Desk (TEST)").
Element (ul.ui-autocomplete a:contains("Customizable Desk (TEST)")) has not been found.
TIMEOUT step failed to complete within 10000 ms.
|
| 10/12/2026 01:55:43 | ERROR |
Subbuild # 423701:
odoo.addons.test_sale_product_configurators.tests.test_sale_product_configurator.TestProductConfiguratorUi.test_03_product_configurator_edition.browser: FAILED: [11/42] Tour sale_product_configurator_edition_tour → Step ul.ui-autocomplete a:contains("Customizable Desk (TEST)").
Element (ul.ui-autocomplete a:contains("Customizable Desk (TEST)")) has not been found.
TIMEOUT step failed to complete within 10000 ms.
|
| 10/12/2026 01:55:43 | ERROR |
Subbuild # 423701:
odoo.addons.test_sale_product_configurators.tests.test_sale_product_configurator: FAIL: TestProductConfiguratorUi.test_03_product_configurator_edition
Traceback (most recent call last):
File "/data/build/rb-12f368c-225484/addons/test_sale_product_configurators/tests/test_sale_product_configurator.py", line 128, in test_03_product_configurator_edition
self.start_tour("/odoo", 'sale_product_configurator_edition_tour', login='salesman')
File "/data/build/rb-12f368c-225484/odoo/tests/common.py", line 2612, in start_tour
self.browser_js(url_path=url_path, code=code, ready=ready, timeout=timeout, success_signal="tour succeeded", **kwargs)
File "/data/build/rb-12f368c-225484/odoo/tests/common.py", line 2582, in browser_js
self.fail('%s\n\n%s' % (message, error))
AssertionError: The test code "odoo.startTour('sale_product_configurator_edition_tour', {"stepDelay": 0, "keepWatchBrowser": false, "debug": false, "startUrl": "/odoo", "delayToCheckUndeterminisms": 0})" failed
FAILED: [11/42] Tour sale_product_configurator_edition_tour → Step ul.ui-autocomplete a:contains("Customizable Desk (TEST)").
Element (ul.ui-autocomplete a:contains("Customizable Desk (TEST)")) has not been found.
TIMEOUT step failed to complete within 10000 ms.
|
| 10/12/2026 01:55:43 | ERROR |
Subbuild # 423701:
odoo.addons.test_sale_product_configurators.tests.test_sale_product_configurator.TestProductConfiguratorUi.test_05_product_configurator_pricelist.browser: FAILED: [15/29] Tour sale_product_configurator_pricelist_tour → Step ul.ui-autocomplete a:contains("Customizable Desk (TEST)").
Element (ul.ui-autocomplete a:contains("Customizable Desk (TEST)")) has not been found.
TIMEOUT step failed to complete within 10000 ms.
|
| 10/12/2026 01:55:43 | ERROR |
Subbuild # 423701:
odoo.addons.test_sale_product_configurators.tests.test_sale_product_configurator: FAIL: TestProductConfiguratorUi.test_05_product_configurator_pricelist
Traceback (most recent call last):
File "/data/build/rb-12f368c-225484/addons/test_sale_product_configurators/tests/test_sale_product_configurator.py", line 193, in test_05_product_configurator_pricelist
self.start_tour("/odoo", 'sale_product_configurator_pricelist_tour', login='salesman')
File "/data/build/rb-12f368c-225484/odoo/tests/common.py", line 2612, in start_tour
self.browser_js(url_path=url_path, code=code, ready=ready, timeout=timeout, success_signal="tour succeeded", **kwargs)
File "/data/build/rb-12f368c-225484/odoo/tests/common.py", line 2582, in browser_js
self.fail('%s\n\n%s' % (message, error))
AssertionError: The test code "odoo.startTour('sale_product_configurator_pricelist_tour', {"stepDelay": 0, "keepWatchBrowser": false, "debug": false, "startUrl": "/odoo", "delayToCheckUndeterminisms": 0})" failed
FAILED: [15/29] Tour sale_product_configurator_pricelist_tour → Step ul.ui-autocomplete a:contains("Customizable Desk (TEST)").
Element (ul.ui-autocomplete a:contains("Customizable Desk (TEST)")) has not been found.
TIMEOUT step failed to complete within 10000 ms.
|
| 10/12/2026 01:55:43 | ERROR |
Subbuild # 423701:
odoo.addons.test_sale_product_configurators.tests.test_sale_product_configurator.TestProductConfiguratorUi.test_06_product_configurator_optional_products.browser: FAILED: [11/26] Tour sale_product_configurator_optional_products_tour → Step ul.ui-autocomplete a:contains("Customizable Desk (TEST)").
Element (ul.ui-autocomplete a:contains("Customizable Desk (TEST)")) has not been found.
TIMEOUT step failed to complete within 10000 ms.
|
| 10/12/2026 01:55:43 | ERROR |
Subbuild # 423701:
odoo.addons.test_sale_product_configurators.tests.test_sale_product_configurator: FAIL: TestProductConfiguratorUi.test_06_product_configurator_optional_products
Traceback (most recent call last):
File "/data/build/rb-12f368c-225484/addons/test_sale_product_configurators/tests/test_sale_product_configurator.py", line 219, in test_06_product_configurator_optional_products
self.start_tour(
File "/data/build/rb-12f368c-225484/odoo/tests/common.py", line 2612, in start_tour
self.browser_js(url_path=url_path, code=code, ready=ready, timeout=timeout, success_signal="tour succeeded", **kwargs)
File "/data/build/rb-12f368c-225484/odoo/tests/common.py", line 2582, in browser_js
self.fail('%s\n\n%s' % (message, error))
AssertionError: The test code "odoo.startTour('sale_product_configurator_optional_products_tour', {"stepDelay": 0, "keepWatchBrowser": false, "debug": false, "startUrl": "/odoo", "delayToCheckUndeterminisms": 0})" failed
FAILED: [11/26] Tour sale_product_configurator_optional_products_tour → Step ul.ui-autocomplete a:contains("Customizable Desk (TEST)").
Element (ul.ui-autocomplete a:contains("Customizable Desk (TEST)")) has not been found.
TIMEOUT step failed to complete within 10000 ms.
|
| 10/12/2026 01:55:43 | ERROR |
Subbuild # 423701:
odoo.addons.test_sale_product_configurators.tests.test_sale_product_configurator.TestProductConfiguratorUi.test_product_attribute_multi_type.browser: FAILED: [11/16] Tour product_attribute_multi_type → Step ul.ui-autocomplete a:contains("Big Burger").
Element (ul.ui-autocomplete a:contains("Big Burger")) has not been found.
TIMEOUT step failed to complete within 10000 ms.
|
| 10/12/2026 01:55:43 | ERROR |
Subbuild # 423701:
odoo.addons.test_sale_product_configurators.tests.test_sale_product_configurator: FAIL: TestProductConfiguratorUi.test_product_attribute_multi_type
Traceback (most recent call last):
File "/data/build/rb-12f368c-225484/addons/test_sale_product_configurators/tests/test_sale_product_configurator.py", line 286, in test_product_attribute_multi_type
self.start_tour("/odoo", 'product_attribute_multi_type', login="salesman")
File "/data/build/rb-12f368c-225484/odoo/tests/common.py", line 2612, in start_tour
self.browser_js(url_path=url_path, code=code, ready=ready, timeout=timeout, success_signal="tour succeeded", **kwargs)
File "/data/build/rb-12f368c-225484/odoo/tests/common.py", line 2582, in browser_js
self.fail('%s\n\n%s' % (message, error))
AssertionError: The test code "odoo.startTour('product_attribute_multi_type', {"stepDelay": 0, "keepWatchBrowser": false, "debug": false, "startUrl": "/odoo", "delayToCheckUndeterminisms": 0})" failed
FAILED: [11/16] Tour product_attribute_multi_type → Step ul.ui-autocomplete a:contains("Big Burger").
Element (ul.ui-autocomplete a:contains("Big Burger")) has not been found.
TIMEOUT step failed to complete within 10000 ms.
|
| 10/12/2026 01:55:43 | ERROR |
Subbuild # 423701:
odoo.addons.test_sale_product_configurators.tests.test_sale_product_configurator.TestProductConfiguratorUi.test_product_configurator_uom_selection.browser: FAILED: [14/37] Tour sale_product_configurator_uom_tour → Step ul.ui-autocomplete a:contains("Customizable Desk (TEST)").
Element (ul.ui-autocomplete a:contains("Customizable Desk (TEST)")) has not been found.
TIMEOUT step failed to complete within 10000 ms.
|
| 10/12/2026 01:55:43 | ERROR |
Subbuild # 423701:
odoo.addons.test_sale_product_configurators.tests.test_sale_product_configurator: FAIL: TestProductConfiguratorUi.test_product_configurator_uom_selection
Traceback (most recent call last):
File "/data/build/rb-12f368c-225484/addons/test_sale_product_configurators/tests/test_sale_product_configurator.py", line 335, in test_product_configurator_uom_selection
self.start_tour("/odoo", 'sale_product_configurator_uom_tour', login='salesman')
File "/data/build/rb-12f368c-225484/odoo/tests/common.py", line 2612, in start_tour
self.browser_js(url_path=url_path, code=code, ready=ready, timeout=timeout, success_signal="tour succeeded", **kwargs)
File "/data/build/rb-12f368c-225484/odoo/tests/common.py", line 2582, in browser_js
self.fail('%s\n\n%s' % (message, error))
AssertionError: The test code "odoo.startTour('sale_product_configurator_uom_tour', {"stepDelay": 0, "keepWatchBrowser": false, "debug": false, "startUrl": "/odoo", "delayToCheckUndeterminisms": 0})" failed
FAILED: [14/37] Tour sale_product_configurator_uom_tour → Step ul.ui-autocomplete a:contains("Customizable Desk (TEST)").
Element (ul.ui-autocomplete a:contains("Customizable Desk (TEST)")) has not been found.
TIMEOUT step failed to complete within 10000 ms.
|
| 10/12/2026 01:55:43 | ERROR |
Subbuild # 423701:
odoo.addons.test_sale_product_configurators.tests.test_sale_product_configurator.TestProductConfiguratorUi.test_product_configurator_update_custom_values.browser: FAILED: [11/27] Tour sale_product_configurator_custom_value_update_tour → Step ul.ui-autocomplete a:contains("Customizable Desk (TEST)").
Element (ul.ui-autocomplete a:contains("Customizable Desk (TEST)")) has not been found.
TIMEOUT step failed to complete within 10000 ms.
|
| 10/12/2026 01:55:43 | ERROR |
Subbuild # 423701:
odoo.addons.test_sale_product_configurators.tests.test_sale_product_configurator: FAIL: TestProductConfiguratorUi.test_product_configurator_update_custom_values
Traceback (most recent call last):
File "/data/build/rb-12f368c-225484/addons/test_sale_product_configurators/tests/test_sale_product_configurator.py", line 248, in test_product_configurator_update_custom_values
self.start_tour(
File "/data/build/rb-12f368c-225484/odoo/tests/common.py", line 2612, in start_tour
self.browser_js(url_path=url_path, code=code, ready=ready, timeout=timeout, success_signal="tour succeeded", **kwargs)
File "/data/build/rb-12f368c-225484/odoo/tests/common.py", line 2582, in browser_js
self.fail('%s\n\n%s' % (message, error))
AssertionError: The test code "odoo.startTour('sale_product_configurator_custom_value_update_tour', {"stepDelay": 0, "keepWatchBrowser": false, "debug": false, "startUrl": "/odoo", "delayToCheckUndeterminisms": 0})" failed
FAILED: [11/27] Tour sale_product_configurator_custom_value_update_tour → Step ul.ui-autocomplete a:contains("Customizable Desk (TEST)").
Element (ul.ui-autocomplete a:contains("Customizable Desk (TEST)")) has not been found.
TIMEOUT step failed to complete within 10000 ms.
|
| 10/12/2026 01:55:43 | ERROR |
Subbuild # 423701:
odoo.addons.test_sale_product_configurators.tests.test_sale_product_matrix.TestSaleMatrixUi.test_sale_matrix_ui.browser: FAILED: [11/47] Tour sale_matrix_tour → Step ul.ui-autocomplete a:contains("Matrix").
Element (ul.ui-autocomplete a:contains("Matrix")) has not been found.
TIMEOUT step failed to complete within 10000 ms.
|
| 10/12/2026 01:55:43 | ERROR |
Subbuild # 423701:
odoo.addons.test_sale_product_configurators.tests.test_sale_product_matrix: FAIL: TestSaleMatrixUi.test_sale_matrix_ui
Traceback (most recent call last):
File "/data/build/rb-12f368c-225484/addons/test_sale_product_configurators/tests/test_sale_product_matrix.py", line 58, in test_sale_matrix_ui
self.start_tour("/odoo", 'sale_matrix_tour', login='salesman')
File "/data/build/rb-12f368c-225484/odoo/tests/common.py", line 2612, in start_tour
self.browser_js(url_path=url_path, code=code, ready=ready, timeout=timeout, success_signal="tour succeeded", **kwargs)
File "/data/build/rb-12f368c-225484/odoo/tests/common.py", line 2582, in browser_js
self.fail('%s\n\n%s' % (message, error))
AssertionError: The test code "odoo.startTour('sale_matrix_tour', {"stepDelay": 0, "keepWatchBrowser": false, "debug": false, "startUrl": "/odoo", "delayToCheckUndeterminisms": 0})" failed
FAILED: [11/47] Tour sale_matrix_tour → Step ul.ui-autocomplete a:contains("Matrix").
Element (ul.ui-autocomplete a:contains("Matrix")) has not been found.
TIMEOUT step failed to complete within 10000 ms.
|
| 10/12/2026 01:55:43 | WARNING |
Subbuild # 423701:
odoo.addons.test_website.tests.test_media.TestMedia.test_01_replace_media.browser: Invalid selection. Node is not part of the editable: None
|
| 10/12/2026 01:55:43 | ERROR |
Subbuild # 423701:
odoo.addons.test_website.tests.test_media.TestMedia.test_01_replace_media.browser: FAILED: [18/36] Tour test_replace_media → Step ensure icon block is displayed (trigger: .o_customize_tab [data-container-title='Icon']).
Element (.o_customize_tab [data-container-title='Icon']) has not been found.
TIMEOUT step failed to complete within 10000 ms.
|
| 10/12/2026 01:55:43 | ERROR |
Subbuild # 423701:
odoo.addons.test_website.tests.test_media: FAIL: TestMedia.test_01_replace_media
Traceback (most recent call last):
File "/data/build/rb-12f368c-225484/odoo/tools/misc.py", line 779, in deco
return func(*args, **kwargs)
^^^^^^^^^^^^^^^^^^^^^
File "/data/build/rb-12f368c-225484/addons/test_website/tests/test_media.py", line 22, in test_01_replace_media
self.start_tour("/", 'test_replace_media', login="admin")
File "/data/build/rb-12f368c-225484/odoo/tests/common.py", line 2612, in start_tour
self.browser_js(url_path=url_path, code=code, ready=ready, timeout=timeout, success_signal="tour succeeded", **kwargs)
File "/data/build/rb-12f368c-225484/odoo/tests/common.py", line 2582, in browser_js
self.fail('%s\n\n%s' % (message, error))
AssertionError: The test code "odoo.startTour('test_replace_media', {"stepDelay": 0, "keepWatchBrowser": false, "debug": false, "startUrl": "/", "delayToCheckUndeterminisms": 0})" failed
FAILED: [18/36] Tour test_replace_media → Step ensure icon block is displayed (trigger: .o_customize_tab [data-container-title='Icon']).
Element (.o_customize_tab [data-container-title='Icon']) has not been found.
TIMEOUT step failed to complete within 10000 ms.
|
| 10/12/2026 01:55:43 | ERROR |
Subbuild # 423701:
odoo.tests.result: 11 failed, 0 error(s) of 3246 tests when loading database 'rb-12f368c-225484-423701'
|
| 10/12/2026 01:40:05 | ERROR |
Subbuild # 423703:
odoo.tests.suite: ERROR: setUpClass (odoo.addons.viin_document_parsing.tests.test_provider_api_key_access.TestProviderApiKeyRpcAccess)
Traceback (most recent call last):
File "/data/build/Viindoo-tvtmaaddons-19.0/viin_document_parsing/tests/test_provider_api_key_access.py", line 91, in setUpClass
cls.user = Users.create({
^^^^^^^^^^^^^^
File "/data/build/rb-12f368c-225484/odoo/orm/decorators.py", line 369, in create
return method(self, vals_list)
^^^^^^^^^^^^^^^^^^^^^^^
File "/data/build/rb-12f368c-225484/addons/website_slides/models/res_users.py", line 13, in create
users = super().create(vals_list)
^^^^^^^^^^^^^^^^^^^^^^^^^
File "/data/build/rb-12f368c-225484/odoo/orm/decorators.py", line 369, in create
return method(self, vals_list)
^^^^^^^^^^^^^^^^^^^^^^^
File "/data/build/Viindoo-tvtmaaddons-19.0/viin_affiliate/models/res_users.py", line 43, in create
res = super(ResUsers, self).create(vals_list)
^^^^^^^^^^^^^^^^^^^^^^^^^^^^^^^^^^^^^^^
File "/data/build/rb-12f368c-225484/odoo/orm/decorators.py", line 369, in create
return method(self, vals_list)
^^^^^^^^^^^^^^^^^^^^^^^
File "/data/build/rb-12f368c-225484/addons/hr_holidays/models/res_users.py", line 68, in create
users = super().create(vals_list)
^^^^^^^^^^^^^^^^^^^^^^^^^
File "/data/build/rb-12f368c-225484/odoo/orm/decorators.py", line 369, in create
return method(self, vals_list)
^^^^^^^^^^^^^^^^^^^^^^^
File "/data/build/rb-12f368c-225484/addons/project/models/res_users.py", line 12, in create
res = super().create(vals_list)
^^^^^^^^^^^^^^^^^^^^^^^^^
File "/data/build/rb-12f368c-225484/odoo/orm/decorators.py", line 369, in create
return method(self, vals_list)
^^^^^^^^^^^^^^^^^^^^^^^
File "/data/build/rb-12f368c-225484/addons/hr/models/res_users.py", line 165, in create
res = super().create(vals_list)
^^^^^^^^^^^^^^^^^^^^^^^^^
File "/data/build/rb-12f368c-225484/odoo/orm/decorators.py", line 369, in create
return method(self, vals_list)
^^^^^^^^^^^^^^^^^^^^^^^
File "/data/build/rb-12f368c-225484/addons/digest/models/res_users.py", line 12, in create
users = super(ResUsers, self).create(vals_list)
^^^^^^^^^^^^^^^^^^^^^^^^^^^^^^^^^^^^^^^
File "/data/build/rb-12f368c-225484/odoo/orm/decorators.py", line 369, in create
return method(self, vals_list)
^^^^^^^^^^^^^^^^^^^^^^^
File "/data/build/Viindoo-tvtmaaddons-19.0/to_erponline_utility/models/res_user.py", line 76, in create
new_users = super(ResUser, self).create(vals_list)
^^^^^^^^^^^^^^^^^^^^^^^^^^^^^^^^^^^^^^
File "/data/build/rb-12f368c-225484/odoo/orm/decorators.py", line 369, in create
return method(self, vals_list)
^^^^^^^^^^^^^^^^^^^^^^^
File "/data/build/rb-12f368c-225484/addons/gamification/models/res_users.py", line 72, in create
res = super().create(vals_list)
^^^^^^^^^^^^^^^^^^^^^^^^^
File "/data/build/rb-12f368c-225484/odoo/orm/decorators.py", line 369, in create
return method(self, vals_list)
^^^^^^^^^^^^^^^^^^^^^^^
File "/data/build/rb-12f368c-225484/addons/calendar/models/res_users.py", line 63, in create
res = super().create(vals_list)
^^^^^^^^^^^^^^^^^^^^^^^^^
File "/data/build/rb-12f368c-225484/odoo/orm/decorators.py", line 369, in create
return method(self, vals_list)
^^^^^^^^^^^^^^^^^^^^^^^
File "/data/build/rb-12f368c-225484/addons/auth_signup/models/res_users.py", line 272, in create
users = super(ResUsers, self).create(vals_list)
^^^^^^^^^^^^^^^^^^^^^^^^^^^^^^^^^^^^^^^
File "/data/build/rb-12f368c-225484/odoo/orm/decorators.py", line 369, in create
return method(self, vals_list)
^^^^^^^^^^^^^^^^^^^^^^^
File "/data/build/rb-12f368c-225484/addons/mail/models/discuss/res_users.py", line 14, in create
users = super().create(vals_list)
^^^^^^^^^^^^^^^^^^^^^^^^^
File "/data/build/rb-12f368c-225484/odoo/orm/decorators.py", line 369, in create
return method(self, vals_list)
^^^^^^^^^^^^^^^^^^^^^^^
File "/data/build/rb-12f368c-225484/addons/mail/models/res_users.py", line 182, in create
users = super().create(vals_list)
^^^^^^^^^^^^^^^^^^^^^^^^^
File "/data/build/rb-12f368c-225484/odoo/orm/decorators.py", line 369, in create
return method(self, vals_list)
^^^^^^^^^^^^^^^^^^^^^^^
File "/data/build/rb-12f368c-225484/odoo/addons/base/models/res_users.py", line 1357, in create
users = super().create(vals_list)
^^^^^^^^^^^^^^^^^^^^^^^^^
File "/data/build/rb-12f368c-225484/odoo/orm/decorators.py", line 369, in create
return method(self, vals_list)
^^^^^^^^^^^^^^^^^^^^^^^
File "/data/build/rb-12f368c-225484/odoo/addons/base/models/res_users.py", line 580, in create
users = super().create(vals_list)
^^^^^^^^^^^^^^^^^^^^^^^^^
File "/data/build/rb-12f368c-225484/odoo/orm/decorators.py", line 369, in create
return method(self, vals_list)
^^^^^^^^^^^^^^^^^^^^^^^
File "/data/build/Viindoo-erponline-enterprise-19.0/viin_customizer/models/models.py", line 123, in create
return super().create(vals_list)
^^^^^^^^^^^^^^^^^^^^^^^^^
File "/data/build/rb-12f368c-225484/odoo/orm/decorators.py", line 369, in create
return method(self, vals_list)
^^^^^^^^^^^^^^^^^^^^^^^
File "/data/build/rb-12f368c-225484/odoo/orm/models.py", line 4660, in create
raise ValueError(f"Invalid field {field_name!r} in {self._name!r}")
ValueError: Invalid field 'groups_id' in 'res.users'
|
| 10/12/2026 01:40:05 | ERROR |
Subbuild # 423703:
odoo.tests.suite: ERROR: setUpClass (odoo.addons.viin_document_parsing.tests.test_provider_api_key_access.TestProviderApiKeyServerSideUse)
Traceback (most recent call last):
File "/data/build/Viindoo-tvtmaaddons-19.0/viin_document_parsing/tests/test_provider_api_key_access.py", line 91, in setUpClass
cls.user = Users.create({
^^^^^^^^^^^^^^
File "/data/build/rb-12f368c-225484/odoo/orm/decorators.py", line 369, in create
return method(self, vals_list)
^^^^^^^^^^^^^^^^^^^^^^^
File "/data/build/rb-12f368c-225484/addons/website_slides/models/res_users.py", line 13, in create
users = super().create(vals_list)
^^^^^^^^^^^^^^^^^^^^^^^^^
File "/data/build/rb-12f368c-225484/odoo/orm/decorators.py", line 369, in create
return method(self, vals_list)
^^^^^^^^^^^^^^^^^^^^^^^
File "/data/build/Viindoo-tvtmaaddons-19.0/viin_affiliate/models/res_users.py", line 43, in create
res = super(ResUsers, self).create(vals_list)
^^^^^^^^^^^^^^^^^^^^^^^^^^^^^^^^^^^^^^^
File "/data/build/rb-12f368c-225484/odoo/orm/decorators.py", line 369, in create
return method(self, vals_list)
^^^^^^^^^^^^^^^^^^^^^^^
File "/data/build/rb-12f368c-225484/addons/hr_holidays/models/res_users.py", line 68, in create
users = super().create(vals_list)
^^^^^^^^^^^^^^^^^^^^^^^^^
File "/data/build/rb-12f368c-225484/odoo/orm/decorators.py", line 369, in create
return method(self, vals_list)
^^^^^^^^^^^^^^^^^^^^^^^
File "/data/build/rb-12f368c-225484/addons/project/models/res_users.py", line 12, in create
res = super().create(vals_list)
^^^^^^^^^^^^^^^^^^^^^^^^^
File "/data/build/rb-12f368c-225484/odoo/orm/decorators.py", line 369, in create
return method(self, vals_list)
^^^^^^^^^^^^^^^^^^^^^^^
File "/data/build/rb-12f368c-225484/addons/hr/models/res_users.py", line 165, in create
res = super().create(vals_list)
^^^^^^^^^^^^^^^^^^^^^^^^^
File "/data/build/rb-12f368c-225484/odoo/orm/decorators.py", line 369, in create
return method(self, vals_list)
^^^^^^^^^^^^^^^^^^^^^^^
File "/data/build/rb-12f368c-225484/addons/digest/models/res_users.py", line 12, in create
users = super(ResUsers, self).create(vals_list)
^^^^^^^^^^^^^^^^^^^^^^^^^^^^^^^^^^^^^^^
File "/data/build/rb-12f368c-225484/odoo/orm/decorators.py", line 369, in create
return method(self, vals_list)
^^^^^^^^^^^^^^^^^^^^^^^
File "/data/build/Viindoo-tvtmaaddons-19.0/to_erponline_utility/models/res_user.py", line 76, in create
new_users = super(ResUser, self).create(vals_list)
^^^^^^^^^^^^^^^^^^^^^^^^^^^^^^^^^^^^^^
File "/data/build/rb-12f368c-225484/odoo/orm/decorators.py", line 369, in create
return method(self, vals_list)
^^^^^^^^^^^^^^^^^^^^^^^
File "/data/build/rb-12f368c-225484/addons/gamification/models/res_users.py", line 72, in create
res = super().create(vals_list)
^^^^^^^^^^^^^^^^^^^^^^^^^
File "/data/build/rb-12f368c-225484/odoo/orm/decorators.py", line 369, in create
return method(self, vals_list)
^^^^^^^^^^^^^^^^^^^^^^^
File "/data/build/rb-12f368c-225484/addons/calendar/models/res_users.py", line 63, in create
res = super().create(vals_list)
^^^^^^^^^^^^^^^^^^^^^^^^^
File "/data/build/rb-12f368c-225484/odoo/orm/decorators.py", line 369, in create
return method(self, vals_list)
^^^^^^^^^^^^^^^^^^^^^^^
File "/data/build/rb-12f368c-225484/addons/auth_signup/models/res_users.py", line 272, in create
users = super(ResUsers, self).create(vals_list)
^^^^^^^^^^^^^^^^^^^^^^^^^^^^^^^^^^^^^^^
File "/data/build/rb-12f368c-225484/odoo/orm/decorators.py", line 369, in create
return method(self, vals_list)
^^^^^^^^^^^^^^^^^^^^^^^
File "/data/build/rb-12f368c-225484/addons/mail/models/discuss/res_users.py", line 14, in create
users = super().create(vals_list)
^^^^^^^^^^^^^^^^^^^^^^^^^
File "/data/build/rb-12f368c-225484/odoo/orm/decorators.py", line 369, in create
return method(self, vals_list)
^^^^^^^^^^^^^^^^^^^^^^^
File "/data/build/rb-12f368c-225484/addons/mail/models/res_users.py", line 182, in create
users = super().create(vals_list)
^^^^^^^^^^^^^^^^^^^^^^^^^
File "/data/build/rb-12f368c-225484/odoo/orm/decorators.py", line 369, in create
return method(self, vals_list)
^^^^^^^^^^^^^^^^^^^^^^^
File "/data/build/rb-12f368c-225484/odoo/addons/base/models/res_users.py", line 1357, in create
users = super().create(vals_list)
^^^^^^^^^^^^^^^^^^^^^^^^^
File "/data/build/rb-12f368c-225484/odoo/orm/decorators.py", line 369, in create
return method(self, vals_list)
^^^^^^^^^^^^^^^^^^^^^^^
File "/data/build/rb-12f368c-225484/odoo/addons/base/models/res_users.py", line 580, in create
users = super().create(vals_list)
^^^^^^^^^^^^^^^^^^^^^^^^^
File "/data/build/rb-12f368c-225484/odoo/orm/decorators.py", line 369, in create
return method(self, vals_list)
^^^^^^^^^^^^^^^^^^^^^^^
File "/data/build/Viindoo-erponline-enterprise-19.0/viin_customizer/models/models.py", line 123, in create
return super().create(vals_list)
^^^^^^^^^^^^^^^^^^^^^^^^^
File "/data/build/rb-12f368c-225484/odoo/orm/decorators.py", line 369, in create
return method(self, vals_list)
^^^^^^^^^^^^^^^^^^^^^^^
File "/data/build/rb-12f368c-225484/odoo/orm/models.py", line 4660, in create
raise ValueError(f"Invalid field {field_name!r} in {self._name!r}")
ValueError: Invalid field 'groups_id' in 'res.users'
|
| 10/12/2026 01:40:05 | ERROR |
Subbuild # 423703:
odoo.tests.suite: ERROR: setUpClass (odoo.addons.viin_document_parsing.tests.test_provider_api_key_access.TestProviderApiKeyRequestCache)
Traceback (most recent call last):
File "/data/build/Viindoo-tvtmaaddons-19.0/viin_document_parsing/tests/test_provider_api_key_access.py", line 91, in setUpClass
cls.user = Users.create({
^^^^^^^^^^^^^^
File "/data/build/rb-12f368c-225484/odoo/orm/decorators.py", line 369, in create
return method(self, vals_list)
^^^^^^^^^^^^^^^^^^^^^^^
File "/data/build/rb-12f368c-225484/addons/website_slides/models/res_users.py", line 13, in create
users = super().create(vals_list)
^^^^^^^^^^^^^^^^^^^^^^^^^
File "/data/build/rb-12f368c-225484/odoo/orm/decorators.py", line 369, in create
return method(self, vals_list)
^^^^^^^^^^^^^^^^^^^^^^^
File "/data/build/Viindoo-tvtmaaddons-19.0/viin_affiliate/models/res_users.py", line 43, in create
res = super(ResUsers, self).create(vals_list)
^^^^^^^^^^^^^^^^^^^^^^^^^^^^^^^^^^^^^^^
File "/data/build/rb-12f368c-225484/odoo/orm/decorators.py", line 369, in create
return method(self, vals_list)
^^^^^^^^^^^^^^^^^^^^^^^
File "/data/build/rb-12f368c-225484/addons/hr_holidays/models/res_users.py", line 68, in create
users = super().create(vals_list)
^^^^^^^^^^^^^^^^^^^^^^^^^
File "/data/build/rb-12f368c-225484/odoo/orm/decorators.py", line 369, in create
return method(self, vals_list)
^^^^^^^^^^^^^^^^^^^^^^^
File "/data/build/rb-12f368c-225484/addons/project/models/res_users.py", line 12, in create
res = super().create(vals_list)
^^^^^^^^^^^^^^^^^^^^^^^^^
File "/data/build/rb-12f368c-225484/odoo/orm/decorators.py", line 369, in create
return method(self, vals_list)
^^^^^^^^^^^^^^^^^^^^^^^
File "/data/build/rb-12f368c-225484/addons/hr/models/res_users.py", line 165, in create
res = super().create(vals_list)
^^^^^^^^^^^^^^^^^^^^^^^^^
File "/data/build/rb-12f368c-225484/odoo/orm/decorators.py", line 369, in create
return method(self, vals_list)
^^^^^^^^^^^^^^^^^^^^^^^
File "/data/build/rb-12f368c-225484/addons/digest/models/res_users.py", line 12, in create
users = super(ResUsers, self).create(vals_list)
^^^^^^^^^^^^^^^^^^^^^^^^^^^^^^^^^^^^^^^
File "/data/build/rb-12f368c-225484/odoo/orm/decorators.py", line 369, in create
return method(self, vals_list)
^^^^^^^^^^^^^^^^^^^^^^^
File "/data/build/Viindoo-tvtmaaddons-19.0/to_erponline_utility/models/res_user.py", line 76, in create
new_users = super(ResUser, self).create(vals_list)
^^^^^^^^^^^^^^^^^^^^^^^^^^^^^^^^^^^^^^
File "/data/build/rb-12f368c-225484/odoo/orm/decorators.py", line 369, in create
return method(self, vals_list)
^^^^^^^^^^^^^^^^^^^^^^^
File "/data/build/rb-12f368c-225484/addons/gamification/models/res_users.py", line 72, in create
res = super().create(vals_list)
^^^^^^^^^^^^^^^^^^^^^^^^^
File "/data/build/rb-12f368c-225484/odoo/orm/decorators.py", line 369, in create
return method(self, vals_list)
^^^^^^^^^^^^^^^^^^^^^^^
File "/data/build/rb-12f368c-225484/addons/calendar/models/res_users.py", line 63, in create
res = super().create(vals_list)
^^^^^^^^^^^^^^^^^^^^^^^^^
File "/data/build/rb-12f368c-225484/odoo/orm/decorators.py", line 369, in create
return method(self, vals_list)
^^^^^^^^^^^^^^^^^^^^^^^
File "/data/build/rb-12f368c-225484/addons/auth_signup/models/res_users.py", line 272, in create
users = super(ResUsers, self).create(vals_list)
^^^^^^^^^^^^^^^^^^^^^^^^^^^^^^^^^^^^^^^
File "/data/build/rb-12f368c-225484/odoo/orm/decorators.py", line 369, in create
return method(self, vals_list)
^^^^^^^^^^^^^^^^^^^^^^^
File "/data/build/rb-12f368c-225484/addons/mail/models/discuss/res_users.py", line 14, in create
users = super().create(vals_list)
^^^^^^^^^^^^^^^^^^^^^^^^^
File "/data/build/rb-12f368c-225484/odoo/orm/decorators.py", line 369, in create
return method(self, vals_list)
^^^^^^^^^^^^^^^^^^^^^^^
File "/data/build/rb-12f368c-225484/addons/mail/models/res_users.py", line 182, in create
users = super().create(vals_list)
^^^^^^^^^^^^^^^^^^^^^^^^^
File "/data/build/rb-12f368c-225484/odoo/orm/decorators.py", line 369, in create
return method(self, vals_list)
^^^^^^^^^^^^^^^^^^^^^^^
File "/data/build/rb-12f368c-225484/odoo/addons/base/models/res_users.py", line 1357, in create
users = super().create(vals_list)
^^^^^^^^^^^^^^^^^^^^^^^^^
File "/data/build/rb-12f368c-225484/odoo/orm/decorators.py", line 369, in create
return method(self, vals_list)
^^^^^^^^^^^^^^^^^^^^^^^
File "/data/build/rb-12f368c-225484/odoo/addons/base/models/res_users.py", line 580, in create
users = super().create(vals_list)
^^^^^^^^^^^^^^^^^^^^^^^^^
File "/data/build/rb-12f368c-225484/odoo/orm/decorators.py", line 369, in create
return method(self, vals_list)
^^^^^^^^^^^^^^^^^^^^^^^
File "/data/build/Viindoo-erponline-enterprise-19.0/viin_customizer/models/models.py", line 123, in create
return super().create(vals_list)
^^^^^^^^^^^^^^^^^^^^^^^^^
File "/data/build/rb-12f368c-225484/odoo/orm/decorators.py", line 369, in create
return method(self, vals_list)
^^^^^^^^^^^^^^^^^^^^^^^
File "/data/build/rb-12f368c-225484/odoo/orm/models.py", line 4660, in create
raise ValueError(f"Invalid field {field_name!r} in {self._name!r}")
ValueError: Invalid field 'groups_id' in 'res.users'
|
| 10/12/2026 01:40:05 | ERROR |
Subbuild # 423703:
odoo.tests.suite: ERROR: setUpClass (odoo.addons.viin_document_parsing.tests.test_provider_api_key_access.TestProviderErrorTextHidesApiKey)
Traceback (most recent call last):
File "/data/build/Viindoo-tvtmaaddons-19.0/viin_document_parsing/tests/test_provider_api_key_access.py", line 91, in setUpClass
cls.user = Users.create({
^^^^^^^^^^^^^^
File "/data/build/rb-12f368c-225484/odoo/orm/decorators.py", line 369, in create
return method(self, vals_list)
^^^^^^^^^^^^^^^^^^^^^^^
File "/data/build/rb-12f368c-225484/addons/website_slides/models/res_users.py", line 13, in create
users = super().create(vals_list)
^^^^^^^^^^^^^^^^^^^^^^^^^
File "/data/build/rb-12f368c-225484/odoo/orm/decorators.py", line 369, in create
return method(self, vals_list)
^^^^^^^^^^^^^^^^^^^^^^^
File "/data/build/Viindoo-tvtmaaddons-19.0/viin_affiliate/models/res_users.py", line 43, in create
res = super(ResUsers, self).create(vals_list)
^^^^^^^^^^^^^^^^^^^^^^^^^^^^^^^^^^^^^^^
File "/data/build/rb-12f368c-225484/odoo/orm/decorators.py", line 369, in create
return method(self, vals_list)
^^^^^^^^^^^^^^^^^^^^^^^
File "/data/build/rb-12f368c-225484/addons/hr_holidays/models/res_users.py", line 68, in create
users = super().create(vals_list)
^^^^^^^^^^^^^^^^^^^^^^^^^
File "/data/build/rb-12f368c-225484/odoo/orm/decorators.py", line 369, in create
return method(self, vals_list)
^^^^^^^^^^^^^^^^^^^^^^^
File "/data/build/rb-12f368c-225484/addons/project/models/res_users.py", line 12, in create
res = super().create(vals_list)
^^^^^^^^^^^^^^^^^^^^^^^^^
File "/data/build/rb-12f368c-225484/odoo/orm/decorators.py", line 369, in create
return method(self, vals_list)
^^^^^^^^^^^^^^^^^^^^^^^
File "/data/build/rb-12f368c-225484/addons/hr/models/res_users.py", line 165, in create
res = super().create(vals_list)
^^^^^^^^^^^^^^^^^^^^^^^^^
File "/data/build/rb-12f368c-225484/odoo/orm/decorators.py", line 369, in create
return method(self, vals_list)
^^^^^^^^^^^^^^^^^^^^^^^
File "/data/build/rb-12f368c-225484/addons/digest/models/res_users.py", line 12, in create
users = super(ResUsers, self).create(vals_list)
^^^^^^^^^^^^^^^^^^^^^^^^^^^^^^^^^^^^^^^
File "/data/build/rb-12f368c-225484/odoo/orm/decorators.py", line 369, in create
return method(self, vals_list)
^^^^^^^^^^^^^^^^^^^^^^^
File "/data/build/Viindoo-tvtmaaddons-19.0/to_erponline_utility/models/res_user.py", line 76, in create
new_users = super(ResUser, self).create(vals_list)
^^^^^^^^^^^^^^^^^^^^^^^^^^^^^^^^^^^^^^
File "/data/build/rb-12f368c-225484/odoo/orm/decorators.py", line 369, in create
return method(self, vals_list)
^^^^^^^^^^^^^^^^^^^^^^^
File "/data/build/rb-12f368c-225484/addons/gamification/models/res_users.py", line 72, in create
res = super().create(vals_list)
^^^^^^^^^^^^^^^^^^^^^^^^^
File "/data/build/rb-12f368c-225484/odoo/orm/decorators.py", line 369, in create
return method(self, vals_list)
^^^^^^^^^^^^^^^^^^^^^^^
File "/data/build/rb-12f368c-225484/addons/calendar/models/res_users.py", line 63, in create
res = super().create(vals_list)
^^^^^^^^^^^^^^^^^^^^^^^^^
File "/data/build/rb-12f368c-225484/odoo/orm/decorators.py", line 369, in create
return method(self, vals_list)
^^^^^^^^^^^^^^^^^^^^^^^
File "/data/build/rb-12f368c-225484/addons/auth_signup/models/res_users.py", line 272, in create
users = super(ResUsers, self).create(vals_list)
^^^^^^^^^^^^^^^^^^^^^^^^^^^^^^^^^^^^^^^
File "/data/build/rb-12f368c-225484/odoo/orm/decorators.py", line 369, in create
return method(self, vals_list)
^^^^^^^^^^^^^^^^^^^^^^^
File "/data/build/rb-12f368c-225484/addons/mail/models/discuss/res_users.py", line 14, in create
users = super().create(vals_list)
^^^^^^^^^^^^^^^^^^^^^^^^^
File "/data/build/rb-12f368c-225484/odoo/orm/decorators.py", line 369, in create
return method(self, vals_list)
^^^^^^^^^^^^^^^^^^^^^^^
File "/data/build/rb-12f368c-225484/addons/mail/models/res_users.py", line 182, in create
users = super().create(vals_list)
^^^^^^^^^^^^^^^^^^^^^^^^^
File "/data/build/rb-12f368c-225484/odoo/orm/decorators.py", line 369, in create
return method(self, vals_list)
^^^^^^^^^^^^^^^^^^^^^^^
File "/data/build/rb-12f368c-225484/odoo/addons/base/models/res_users.py", line 1357, in create
users = super().create(vals_list)
^^^^^^^^^^^^^^^^^^^^^^^^^
File "/data/build/rb-12f368c-225484/odoo/orm/decorators.py", line 369, in create
return method(self, vals_list)
^^^^^^^^^^^^^^^^^^^^^^^
File "/data/build/rb-12f368c-225484/odoo/addons/base/models/res_users.py", line 580, in create
users = super().create(vals_list)
^^^^^^^^^^^^^^^^^^^^^^^^^
File "/data/build/rb-12f368c-225484/odoo/orm/decorators.py", line 369, in create
return method(self, vals_list)
^^^^^^^^^^^^^^^^^^^^^^^
File "/data/build/Viindoo-erponline-enterprise-19.0/viin_customizer/models/models.py", line 123, in create
return super().create(vals_list)
^^^^^^^^^^^^^^^^^^^^^^^^^
File "/data/build/rb-12f368c-225484/odoo/orm/decorators.py", line 369, in create
return method(self, vals_list)
^^^^^^^^^^^^^^^^^^^^^^^
File "/data/build/rb-12f368c-225484/odoo/orm/models.py", line 4660, in create
raise ValueError(f"Invalid field {field_name!r} in {self._name!r}")
ValueError: Invalid field 'groups_id' in 'res.users'
|
| 10/12/2026 01:40:05 | ERROR |
Subbuild # 423703:
odoo.tests.result: 0 failed, 4 error(s) of 4419 tests when loading database 'rb-12f368c-225484-423703'
|
| 10/12/2026 01:05:03 | ERROR |
Subbuild # 423704:
odoo.addons.web.tests.test_js.WebSuite.test_unit_desktop.browser: [HOOT] Test "@viin_customizer/js/components/customizer_report/editor/customizer_report_editor_branch_popover/CustomizerReportEditor: the branch popover pushes the paper, never covers it/a box the push would move out of view is scrolled back by the least that shows it whole" failed:
Failed assertion:
4. [toBeLessThan] expected value to be strictly less (the box does not end at the bottom of the visible editor)
> Maximum: 1.500
> Received: 11
|
| 10/12/2026 01:05:03 | ERROR |
Subbuild # 423704:
odoo.addons.web.tests.test_js: FAIL: WebSuite.test_unit_desktop
Traceback (most recent call last):
File "/data/build/rb-12f368c-225484/addons/web/tests/test_js.py", line 191, in test_unit_desktop
self.browser_js(f'/web/tests?headless&loglevel=2&preset=desktop&timeout=15000{self.hoot_filters}', "", "", login='admin', timeout=3600, success_signal="[HOOT] Test suite succeeded", error_checker=unit_test_error_checker)
File "/data/build/rb-12f368c-225484/odoo/tests/common.py", line 2582, in browser_js
self.fail('%s\n\n%s' % (message, error))
AssertionError: Some js test failed
Script timeout exceeded
|
| 10/12/2026 01:05:03 | ERROR |
Subbuild # 423704:
odoo.tests.result: 1 failed, 0 error(s) of 715 tests when loading database 'rb-12f368c-225484-423704'
|
| 10/12/2026 01:10:25 | ERROR |
Subbuild # 423705:
odoo.addons.website.tests.test_ui.TestUi.test_hiding_sidebar_header.browser: FAILED: [5/19] Tour hide_sidebar_header → Step Wait for the builder to mount after iframe reload (trigger: :iframe body.editor_enable).
Element (:iframe body.editor_enable) has not been found.
TIMEOUT step failed to complete within 10000 ms.
|
| 10/12/2026 01:10:25 | ERROR |
Subbuild # 423705:
odoo.addons.website.tests.test_ui: FAIL: TestUi.test_hiding_sidebar_header
Traceback (most recent call last):
File "/data/build/rb-12f368c-225484/addons/website/tests/test_ui.py", line 727, in test_hiding_sidebar_header
self.start_tour("/", "hide_sidebar_header", login="admin")
File "/data/build/rb-12f368c-225484/odoo/tests/common.py", line 2612, in start_tour
self.browser_js(url_path=url_path, code=code, ready=ready, timeout=timeout, success_signal="tour succeeded", **kwargs)
File "/data/build/rb-12f368c-225484/odoo/tests/common.py", line 2582, in browser_js
self.fail('%s\n\n%s' % (message, error))
AssertionError: The test code "odoo.startTour('hide_sidebar_header', {"stepDelay": 0, "keepWatchBrowser": false, "debug": false, "startUrl": "/", "delayToCheckUndeterminisms": 0})" failed
FAILED: [5/19] Tour hide_sidebar_header → Step Wait for the builder to mount after iframe reload (trigger: :iframe body.editor_enable).
Element (:iframe body.editor_enable) has not been found.
TIMEOUT step failed to complete within 10000 ms.
|
| 10/12/2026 01:10:25 | ERROR |
Subbuild # 423705:
odoo.tests.result: 1 failed, 0 error(s) of 825 tests when loading database 'rb-12f368c-225484-423705'
|