| Subbuilds | Name | State | Detail |
|---|---|---|---|
| Build 424929 | At install tests: from account to website_twitter 183m | Succeed | Log |
| Build 424930 | Post install tests: step install all modules 78m | Succeed | Log |
| Build 424931 | Post install tests: from account to hr_recruitment_survey 150m | Succeed | Log |
| Build 424932 | Post install tests: from hr_skills to phone_validation 195m | Succeed | Log |
| Build 424933 | Post install tests: from point_of_sale to purchase_requisition_stock 134m | Succeed | Log |
| Build 424934 | Post install tests: from purchase_stock to test_limits 155m | Succeed | Log |
| Build 424935 | Post install tests: from test_mail to to_purchase_line_numbering 184m | Succeed | Log |
| Build 424936 | Post install tests: from to_purchase_order_advance to viin_approval_purpose_routing 298m | Succeed | Log |
| Build 424937 | Post install tests: from viin_approval_sale to viin_product_approval_marketplace 199m | Succeed | Log |
| Build 424938 | Post install tests: from viin_product_approval_marketplace_website_sale to web_unsplash 135m | Succeed | Log |
| Build 424939 | Post install tests: from website to website_twitter 144m | Failed | Log |
| Create Date | Level | Message |
|---|---|---|
| 10/15/2026 11:20:41 AM | INFO |
Updated repository Viindoo-tvtmaaddons
|
| 10/15/2026 11:20:41 AM | INFO |
Updated repository Viindoo-erponline-enterprise
|
| 10/15/2026 11:20:41 AM | INFO |
Updated repository Viindoo-branding
|
| 10/15/2026 11:20:41 AM | INFO |
Cloned repository Viindoo-odoo
|
| 10/15/2026 03:40:00 PM | WARNING |
Subbuild # 424939:
odoo.addons.website.tests.test_ui.TestUi.browser: Tour link_tools failed at step Pick '/contactus (trigger: ul.ui-autocomplete li div:contains('/contactus (Contact Us)'))
{
"content": "Check that link was updated and link content is synced with URL",
"trigger": "iframe .s_text_image p a[href='http://callmemaybe.com']:contains('callmemaybe.com')"
},
{
"content": "Edit link label",
"trigger": "iframe .s_text_image p a",
"run": "[function]"
},
{
"content": "Enter partial URL",
"trigger": "#o_link_dialog_url_input",
"run": "text /contact"
},
----- FAILING STEP -----
{
"content": "Pick '/contactus",
"trigger": "ul.ui-autocomplete li div:contains('/contactus (Contact Us)')"
},
-----------------------
{
"content": "Check that links's href and label were updated",
"trigger": "iframe .s_text_image p a[href='/contactus']:contains('/contactus')",
"isCheck": true
},
{
"content": "Enter a non-existent URL",
"trigger": "#o_link_dialog_url_input",
"run": "text /this-address-does-not-exist"
},
{
"content": "Check that the link's href was updated and click on it",
"trigger": "iframe .s_text_image p a[href='/this-address-does-not-exist']"
},
|
| 10/15/2026 03:40:00 PM | ERROR |
Subbuild # 424939:
odoo.addons.website.tests.test_ui.TestUi.browser: Tour link_tools failed at step Pick '/contactus (trigger: ul.ui-autocomplete li div:contains('/contactus (Contact Us)'))
|
| 10/15/2026 03:40:00 PM | ERROR |
Subbuild # 424939:
odoo.addons.website.tests.test_ui: FAIL: TestUi.test_15_website_link_tools
Traceback (most recent call last):
File "/data/build/rb-98454dd-225562/addons/website/tests/test_ui.py", line 471, in test_15_website_link_tools
self.start_tour(self.env['website'].get_client_action_url('/'), 'link_tools', login="admin")
File "/data/build/rb-98454dd-225562/odoo/tests/common.py", line 2231, in start_tour
return self.browser_js(url_path=url_path, code=code, ready=ready, **kwargs)
File "/data/build/rb-98454dd-225562/odoo/tests/common.py", line 2208, in browser_js
self.fail('%s\n\n%s' % (message, error))
AssertionError: The test code "odoo.startTour('link_tools', {"stepDelay": 0, "keepWatchBrowser": false, "startUrl": "/web#action=website.website_preview&path=%2F"})" failed
Tour link_tools failed at step Pick '/contactus (trigger: ul.ui-autocomplete li div:contains('/contactus (Contact Us)'))
|
| 10/15/2026 03:40:00 PM | ERROR |
Subbuild # 424939:
odoo.tests.result: 1 failed, 0 error(s) of 540 tests when loading database 'rb-98454dd-225562-424939'
|