| Subbuilds | Name | State | Detail |
|---|---|---|---|
| Build 429896 | At install tests: from account to website_twitter 158m | Succeed | Log |
| Build 429897 | Post install tests: step install all modules 54m | Succeed | Log |
| Build 429898 | Post install tests: from account to hr_recruitment_survey 159m | Succeed | Log |
| Build 429899 | Post install tests: from hr_skills to phone_validation |
|
Log |
| Build 429900 | Post install tests: from point_of_sale to purchase_requisition_stock 139m | Succeed | Log |
| Build 429901 | Post install tests: from purchase_stock to test_limits 164m | Succeed | Log |
| Build 429902 | Post install tests: from test_mail to to_purchase_line_numbering |
|
Log |
| Build 429903 | Post install tests: from to_purchase_order_advance to viin_approval_purpose_routing |
|
Log |
| Build 429904 | Post install tests: from viin_approval_sale to viin_product_approval_marketplace |
|
Log |
| Build 429905 | Post install tests: from viin_product_approval_marketplace_website_sale to web_unsplash 134m | Failed | Log |
| Build 429906 | Post install tests: from website to website_twitter 143m | Failed | Log |
| Create Date | Level | Message |
|---|---|---|
| 10/29/2026 08:35:15 AM | INFO |
Updated repository Viindoo-tvtmaaddons
|
| 10/29/2026 08:35:15 AM | INFO |
Updated repository Viindoo-erponline-enterprise
|
| 10/29/2026 08:35:15 AM | INFO |
Updated repository Viindoo-branding
|
| 10/29/2026 08:35:15 AM | INFO |
Cloned repository Viindoo-odoo
|
| 10/29/2026 11:45:49 AM | ERROR |
Subbuild # 429905:
odoo.addons.web.tests.test_js: FAIL: WebSuite.test_js
Traceback (most recent call last):
File "/data/build/rb-19fb48c-226083/addons/web/tests/test_js.py", line 94, in test_js
self.browser_js('/web/tests?mod=web%s' % filter_param, "", "", login='admin', timeout=1800, error_checker=qunit_error_checker)
File "/data/build/rb-19fb48c-226083/odoo/tests/common.py", line 2208, in browser_js
self.fail('%s\n\n%s' % (message, error))
AssertionError: Some js test failed
Script timeout exceeded
|
| 10/29/2026 11:45:49 AM | ERROR |
Subbuild # 429905:
odoo.tests.result: 1 failed, 0 error(s) of 1231 tests when loading database 'rb-19fb48c-226083-429905'
|
| 10/29/2026 11:55:15 AM | WARNING |
Subbuild # 429906:
odoo.addons.website.tests.test_ui.TestUi.browser: Tour link_tools failed at step Pick '/contactus (trigger: ul.ui-autocomplete li div:contains('/contactus (Contact Us)'))
{
"content": "Check that link was updated and link content is synced with URL",
"trigger": "iframe .s_text_image p a[href='http://callmemaybe.com']:contains('callmemaybe.com')"
},
{
"content": "Edit link label",
"trigger": "iframe .s_text_image p a",
"run": "[function]"
},
{
"content": "Enter partial URL",
"trigger": "#o_link_dialog_url_input",
"run": "text /contact"
},
----- FAILING STEP -----
{
"content": "Pick '/contactus",
"trigger": "ul.ui-autocomplete li div:contains('/contactus (Contact Us)')"
},
-----------------------
{
"content": "Check that links's href and label were updated",
"trigger": "iframe .s_text_image p a[href='/contactus']:contains('/contactus')",
"isCheck": true
},
{
"content": "Enter a non-existent URL",
"trigger": "#o_link_dialog_url_input",
"run": "text /this-address-does-not-exist"
},
{
"content": "Check that the link's href was updated and click on it",
"trigger": "iframe .s_text_image p a[href='/this-address-does-not-exist']"
},
|
| 10/29/2026 11:55:15 AM | ERROR |
Subbuild # 429906:
odoo.addons.website.tests.test_ui.TestUi.browser: Tour link_tools failed at step Pick '/contactus (trigger: ul.ui-autocomplete li div:contains('/contactus (Contact Us)'))
|
| 10/29/2026 11:55:15 AM | ERROR |
Subbuild # 429906:
odoo.addons.website.tests.test_ui: FAIL: TestUi.test_15_website_link_tools
Traceback (most recent call last):
File "/data/build/rb-19fb48c-226083/addons/website/tests/test_ui.py", line 471, in test_15_website_link_tools
self.start_tour(self.env['website'].get_client_action_url('/'), 'link_tools', login="admin")
File "/data/build/rb-19fb48c-226083/odoo/tests/common.py", line 2231, in start_tour
return self.browser_js(url_path=url_path, code=code, ready=ready, **kwargs)
File "/data/build/rb-19fb48c-226083/odoo/tests/common.py", line 2208, in browser_js
self.fail('%s\n\n%s' % (message, error))
AssertionError: The test code "odoo.startTour('link_tools', {"stepDelay": 0, "keepWatchBrowser": false, "startUrl": "/web#action=website.website_preview&path=%2F"})" failed
Tour link_tools failed at step Pick '/contactus (trigger: ul.ui-autocomplete li div:contains('/contactus (Contact Us)'))
|
| 10/29/2026 11:55:15 AM | ERROR |
Subbuild # 429906:
odoo.tests.result: 1 failed, 0 error(s) of 543 tests when loading database 'rb-19fb48c-226083-429906'
|