| Subbuilds | Name | State | Detail |
|---|---|---|---|
| Build 426898 | Check the quality with Pylint: from test_lint to test_viin_pylint 40m | Succeed | Log |
| Build 426899 | At install tests: from account to website_timesheet 120m | Succeed | Log |
| Build 426900 | Post install tests: step install all modules 24m | Succeed | Log |
| Build 426901 | Post install tests: from account to hr_recruitment_survey 145m | Failed | Log |
| Build 426902 | Post install tests: from hr_skills to phone_validation 215m | Succeed | Log |
| Build 426903 | Post install tests: from point_of_sale to purchase_requisition_stock 204m | Succeed | Log |
| Build 426904 | Post install tests: from purchase_stock to test_l10n_vn_viin_edi 130m | Succeed | Log |
| Build 426905 | Post install tests: from test_mail to to_product_return_reason_stock 179m | Succeed | Log |
| Build 426906 | Post install tests: from to_registration_email_blacklist to viin_approval_purpose_routing 129m | Succeed | Log |
| Build 426907 | Post install tests: from viin_approval_sale to viin_product 159m | Succeed | Log |
| Build 426908 | Post install tests: from viin_project to web_unsplash 114m | Failed | Log |
| Build 426909 | Post install tests: from website to website_timesheet 114m | Succeed | Log |
| Build 426910 | Test install all modules without demo data: from account to website_timesheet 24m | Succeed | Log |
| Build 426911 | Test install all modules with demo data: from account to website_timesheet 30m | Succeed | Log |
| Create Date | Level | Message |
|---|---|---|
| 10/20/2026 07:45:57 PM | INFO |
Updated repository Viindoo-odoo
|
| 10/20/2026 07:45:57 PM | INFO |
Updated repository Viindoo-tvtmaaddons
|
| 10/20/2026 07:45:57 PM | INFO |
Updated repository Viindoo-erponline-enterprise
|
| 10/20/2026 07:45:57 PM | INFO |
Cloned repository Viindoo-branding
|
| 10/20/2026 10:40:52 PM | ERROR |
Subbuild # 426901:
odoo.addons.hr_expense.tests.test_ui.TestUi.test_expense_manager_can_always_set_employee.browser: FAILED: [13/13] Tour create_expense_no_employee_access_tour → Step Check (trigger: .o_app[data-menu-xmlid="hr_expense.menu_hr_expense_root"]).
Element (.o_app[data-menu-xmlid="hr_expense.menu_hr_expense_root"]) has not been found.
TIMEOUT step failed to complete within 10000 ms.
|
| 10/20/2026 10:40:52 PM | ERROR |
Subbuild # 426901:
odoo.addons.hr_expense.tests.test_ui: FAIL: TestUi.test_expense_manager_can_always_set_employee
Traceback (most recent call last):
File "/data/build/Viindoo-odoo-19.0/addons/hr_expense/tests/test_ui.py", line 22, in test_expense_manager_can_always_set_employee
self.start_tour('/odoo', 'create_expense_no_employee_access_tour', login=self.expense_user_manager.login)
File "/data/build/Viindoo-odoo-19.0/odoo/tests/common.py", line 2612, in start_tour
self.browser_js(url_path=url_path, code=code, ready=ready, timeout=timeout, success_signal="tour succeeded", **kwargs)
File "/data/build/Viindoo-odoo-19.0/odoo/tests/common.py", line 2582, in browser_js
self.fail('%s\n\n%s' % (message, error))
AssertionError: The test code "odoo.startTour('create_expense_no_employee_access_tour', {"stepDelay": 0, "keepWatchBrowser": false, "debug": false, "startUrl": "/odoo", "delayToCheckUndeterminisms": 0})" failed
FAILED: [13/13] Tour create_expense_no_employee_access_tour → Step Check (trigger: .o_app[data-menu-xmlid="hr_expense.menu_hr_expense_root"]).
Element (.o_app[data-menu-xmlid="hr_expense.menu_hr_expense_root"]) has not been found.
TIMEOUT step failed to complete within 10000 ms.
|
| 10/20/2026 10:40:52 PM | ERROR |
Subbuild # 426901:
odoo.tests.result: 1 failed, 0 error(s) of 2350 tests when loading database 'rb-0fc5938-225779-426901'
|
| 10/20/2026 11:40:13 PM | WARNING |
Subbuild # 426903:
odoo.http: You can only cancel a session that is in opening control state and has no orders.
|
| 10/20/2026 11:40:13 PM | WARNING |
Subbuild # 426903:
odoo.http: You can only cancel a session that is in opening control state and has no orders.
|
| 10/20/2026 11:40:13 PM | WARNING |
Subbuild # 426903:
odoo.http: You can only cancel a session that is in opening control state and has no orders.
|
| 10/20/2026 11:40:13 PM | WARNING |
Subbuild # 426903:
odoo.http: You can only cancel a session that is in opening control state and has no orders.
|
| 10/20/2026 10:15:15 PM | ERROR |
Subbuild # 426908:
odoo.addons.viin_spreadsheet.tests.test_odoo_chart_side_panel.TestOdooChartSidePanel.test_an_odoo_chart_is_editable_like_any_other.browser: FAILED: [15/16] Tour viin_spreadsheet_odoo_chart_side_panel_tour → Step The picker offers the Odoo family, and every entry in it applies (trigger: .o-sidePanel select.o-type-selector).
Element has been found.
TIMEOUT step failed to complete within 10000 ms.
|
| 10/20/2026 10:15:15 PM | ERROR |
Subbuild # 426908:
odoo.addons.viin_spreadsheet.tests.test_odoo_chart_side_panel: FAIL: TestOdooChartSidePanel.test_an_odoo_chart_is_editable_like_any_other
Traceback (most recent call last):
File "/data/build/Viindoo-erponline-enterprise-19.0/viin_spreadsheet/tests/test_odoo_chart_side_panel.py", line 109, in test_an_odoo_chart_is_editable_like_any_other
self.start_tour('/odoo', 'viin_spreadsheet_odoo_chart_side_panel_tour', login='admin')
File "/data/build/Viindoo-odoo-19.0/odoo/tests/common.py", line 2612, in start_tour
self.browser_js(url_path=url_path, code=code, ready=ready, timeout=timeout, success_signal="tour succeeded", **kwargs)
File "/data/build/Viindoo-odoo-19.0/odoo/tests/common.py", line 2582, in browser_js
self.fail('%s\n\n%s' % (message, error))
AssertionError: The test code "odoo.startTour('viin_spreadsheet_odoo_chart_side_panel_tour', {"stepDelay": 0, "keepWatchBrowser": false, "debug": false, "startUrl": "/odoo", "delayToCheckUndeterminisms": 0})" failed
FAILED: [15/16] Tour viin_spreadsheet_odoo_chart_side_panel_tour → Step The picker offers the Odoo family, and every entry in it applies (trigger: .o-sidePanel select.o-type-selector).
Element has been found.
TIMEOUT step failed to complete within 10000 ms.
|
| 10/20/2026 10:15:15 PM | ERROR |
Subbuild # 426908:
odoo.tests.result: 1 failed, 0 error(s) of 722 tests when loading database 'rb-0fc5938-225779-426908'
|