| Subbuilds | Name | State | Detail |
|---|---|---|---|
| Build 423139 | At install tests: from account to website_timesheet 118m | Succeed | Log |
| Build 423140 | Post install tests: step install all modules 18m | Succeed | Log |
| Build 423141 | Post install tests: from account to hr_recruitment_survey 134m | Succeed | Log |
| Build 423142 | Post install tests: from hr_skills to phone_validation 139m | Succeed | Log |
| Build 423143 | Post install tests: from point_of_sale to purchase_requisition_stock 184m | Succeed | Log |
| Build 423144 | Post install tests: from purchase_stock to test_l10n_vn_viin_edi 124m | Succeed | Log |
| Build 423145 | Post install tests: from test_mail to to_product_return_reason_stock 159m | Failed | Log |
| Build 423146 | Post install tests: from to_registration_email_blacklist to viin_approval_purpose_routing 69m | Succeed | Log |
| Build 423147 | Post install tests: from viin_approval_sale to viin_product 139m | Succeed | Log |
| Build 423148 | Post install tests: from viin_project to web_unsplash 110m | Failed | Log |
| Build 423149 | Post install tests: from website to website_timesheet 109m | Succeed | Log |
| Create Date | Level | Message |
|---|---|---|
| 10/10/2026 08:25:05 | INFO |
Updated repository Viindoo-tvtmaaddons
|
| 10/10/2026 08:25:05 | INFO |
Updated repository Viindoo-erponline-enterprise
|
| 10/10/2026 08:25:05 | INFO |
Updated repository Viindoo-branding
|
| 10/10/2026 08:25:05 | INFO |
Cloned repository Viindoo-odoo
|
| 10/10/2026 11:50:40 | WARNING |
Subbuild # 423143:
odoo.http: You can only cancel a session that is in opening control state and has no orders.
|
| 10/10/2026 11:25:03 | ERROR |
Subbuild # 423145:
odoo.addons.test_main_flows.tests.test_flow.TestUi.test_01_main_flow_tour.browser: FAILED: [153/306] Tour main_flow_tour → Step .ui-menu-item > a:contains('the_flow.product').
Element (.ui-menu-item > a:contains('the_flow.product')) has not been found.
TIMEOUT step failed to complete within 10000 ms.
|
| 10/10/2026 11:25:03 | ERROR |
Subbuild # 423145:
odoo.addons.test_main_flows.tests.test_flow: FAIL: TestUi.test_01_main_flow_tour
Traceback (most recent call last):
File "/data/build/rb-acb9515-225444/odoo/addons/test_main_flows/tests/test_flow.py", line 107, in test_01_main_flow_tour
self.main_flow_tour()
File "/data/build/rb-acb9515-225444/odoo/addons/test_main_flows/tests/test_flow.py", line 100, in main_flow_tour
self.start_tour("/odoo", 'main_flow_tour', login="admin", timeout=180)
File "/data/build/rb-acb9515-225444/addons/account/tests/common.py", line 1656, in start_tour
super().start_tour(url_path, tour_name, **kwargs)
File "/data/build/rb-acb9515-225444/odoo/tests/common.py", line 2612, in start_tour
self.browser_js(url_path=url_path, code=code, ready=ready, timeout=timeout, success_signal="tour succeeded", **kwargs)
File "/data/build/rb-acb9515-225444/odoo/tests/common.py", line 2582, in browser_js
self.fail('%s\n\n%s' % (message, error))
AssertionError: The test code "odoo.startTour('main_flow_tour', {"stepDelay": 0, "keepWatchBrowser": false, "debug": false, "startUrl": "/odoo", "delayToCheckUndeterminisms": 0})" failed
FAILED: [153/306] Tour main_flow_tour → Step .ui-menu-item > a:contains('the_flow.product').
Element (.ui-menu-item > a:contains('the_flow.product')) has not been found.
TIMEOUT step failed to complete within 10000 ms.
|
| 10/10/2026 11:25:03 | ERROR |
Subbuild # 423145:
odoo.addons.test_sale_product_configurators.tests.test_sale_product_configurator.TestProductConfiguratorUi.test_product_configurator_uom_selection.browser: FAILED: [14/37] Tour sale_product_configurator_uom_tour → Step ul.ui-autocomplete a:contains("Customizable Desk (TEST)").
Element (ul.ui-autocomplete a:contains("Customizable Desk (TEST)")) has not been found.
TIMEOUT step failed to complete within 10000 ms.
|
| 10/10/2026 11:25:03 | ERROR |
Subbuild # 423145:
odoo.addons.test_sale_product_configurators.tests.test_sale_product_configurator: FAIL: TestProductConfiguratorUi.test_product_configurator_uom_selection
Traceback (most recent call last):
File "/data/build/rb-acb9515-225444/addons/test_sale_product_configurators/tests/test_sale_product_configurator.py", line 335, in test_product_configurator_uom_selection
self.start_tour("/odoo", 'sale_product_configurator_uom_tour', login='salesman')
File "/data/build/rb-acb9515-225444/odoo/tests/common.py", line 2612, in start_tour
self.browser_js(url_path=url_path, code=code, ready=ready, timeout=timeout, success_signal="tour succeeded", **kwargs)
File "/data/build/rb-acb9515-225444/odoo/tests/common.py", line 2582, in browser_js
self.fail('%s\n\n%s' % (message, error))
AssertionError: The test code "odoo.startTour('sale_product_configurator_uom_tour', {"stepDelay": 0, "keepWatchBrowser": false, "debug": false, "startUrl": "/odoo", "delayToCheckUndeterminisms": 0})" failed
FAILED: [14/37] Tour sale_product_configurator_uom_tour → Step ul.ui-autocomplete a:contains("Customizable Desk (TEST)").
Element (ul.ui-autocomplete a:contains("Customizable Desk (TEST)")) has not been found.
TIMEOUT step failed to complete within 10000 ms.
|
| 10/10/2026 11:25:03 | ERROR |
Subbuild # 423145:
odoo.addons.test_sale_product_configurators.tests.test_sale_product_matrix.TestSaleMatrixUi.test_sale_matrix_ui.browser: FAILED: [11/47] Tour sale_matrix_tour → Step ul.ui-autocomplete a:contains("Matrix").
Element (ul.ui-autocomplete a:contains("Matrix")) has not been found.
TIMEOUT step failed to complete within 10000 ms.
|
| 10/10/2026 11:25:03 | ERROR |
Subbuild # 423145:
odoo.addons.test_sale_product_configurators.tests.test_sale_product_matrix: FAIL: TestSaleMatrixUi.test_sale_matrix_ui
Traceback (most recent call last):
File "/data/build/rb-acb9515-225444/addons/test_sale_product_configurators/tests/test_sale_product_matrix.py", line 58, in test_sale_matrix_ui
self.start_tour("/odoo", 'sale_matrix_tour', login='salesman')
File "/data/build/rb-acb9515-225444/odoo/tests/common.py", line 2612, in start_tour
self.browser_js(url_path=url_path, code=code, ready=ready, timeout=timeout, success_signal="tour succeeded", **kwargs)
File "/data/build/rb-acb9515-225444/odoo/tests/common.py", line 2582, in browser_js
self.fail('%s\n\n%s' % (message, error))
AssertionError: The test code "odoo.startTour('sale_matrix_tour', {"stepDelay": 0, "keepWatchBrowser": false, "debug": false, "startUrl": "/odoo", "delayToCheckUndeterminisms": 0})" failed
FAILED: [11/47] Tour sale_matrix_tour → Step ul.ui-autocomplete a:contains("Matrix").
Element (ul.ui-autocomplete a:contains("Matrix")) has not been found.
TIMEOUT step failed to complete within 10000 ms.
|
| 10/10/2026 11:25:03 | ERROR |
Subbuild # 423145:
odoo.tests.result: 3 failed, 0 error(s) of 3235 tests when loading database 'rb-acb9515-225444-423145'
|
| 10/10/2026 10:35:28 | ERROR |
Subbuild # 423148:
odoo.addons.web.tests.test_js: FAIL: WebSuite.test_unit_desktop
Traceback (most recent call last):
File "/data/build/rb-acb9515-225444/addons/web/tests/test_js.py", line 191, in test_unit_desktop
self.browser_js(f'/web/tests?headless&loglevel=2&preset=desktop&timeout=15000{self.hoot_filters}', "", "", login='admin', timeout=3600, success_signal="[HOOT] Test suite succeeded", error_checker=unit_test_error_checker)
File "/data/build/rb-acb9515-225444/odoo/tests/common.py", line 2582, in browser_js
self.fail('%s\n\n%s' % (message, error))
AssertionError: Some js test failed
Script timeout exceeded
|
| 10/10/2026 10:35:28 | ERROR |
Subbuild # 423148:
odoo.tests.result: 1 failed, 0 error(s) of 671 tests when loading database 'rb-acb9515-225444-423148'
|