Name: [ADD][13.0]viin_hr_holidays_accrual_holiday: feature automatic holiday allocation

State: Revoked

PR State: open

PR Author: Hoàng Đình Hiếu

PR Author Email: hieu.hoang121199@gmail.com

PR: #2550

Committer: hoangdinhhieu

Committer Email: hieu.hoang121199@gmail.com

Commit: 097a04c559f8ffb2b12263f6c109dbbebb0dc951

Description:

                                            [ADD]viin_hr_holidays_accrual_holiday: clean code
                                            

Branch: 13.0

Instance ID: 26681

Age:

Up-time:

Odoo 13.0

Test at install odoo 13.0

  • create_db create_db: db
  • set_opt set_opt: demo,test
  • set_opt set_opt: test-tags=-post_install,-:TestLeadAssign,-:TestJournalMethods,-/test_l10n_be_hr_payroll_account:TestUi,-.test_01_sale_vat_book_vouchers,-.test_01_content_image_resize_placeholder,-.test_02_content_image_Etag_304,-.test_redirect_to_records,-.test_randomized_certification,-.test_flow_certificate,-.test_flow_public,-.test_unpublished_page,-.test_search,-.test_10_perf_sql_queries_page,-.test_20_perf_sql_queries_homepage,-.test_30_perf_sql_queries_page_no_layout,-.test_process_att_no_request,-.test_process_att_no_website,-.test_process_att_monolang_route,-.test_process_att_no_request_lang,-.test_process_att_with_request_lang,-.test_process_att_matching_cdn_and_lang,-.test_process_att_no_route,-.test_process_att_url_crap,-.test_get_switchable_related_views,-.test_create_visitor_on_tracked_page,-.test_long_period_inactivity,-.test_not_subscribed,-.test_not_subscribed_no_template,-.test_wrong_token,-.test_successful_unsubscribe,-.test_multi_website_views_retrieving,-.test_leave_whole_company_07,-hr_contract:TestHrContracts,-hr_contract:TestContractCalendars,-hr_contract:TestHrContracts2,-stock_account:TestStockValuation,-stock_account:TestStockValuationStandard,-stock_account:TestStockValuationAVCO,-stock_account:TestStockValuationFIFO,-stock_account:TestStockValuationChangeCostMethod,-stock_account:TestStockValuationChangeValuation,-sale_timesheet:TestProjectBilling,-sale_timesheet:TestProjectBillingMulticompany,-sale_timesheet:TestReInvoice,-sale_timesheet:TestReporting,-sale_timesheet:TestSaleService,-sale_timesheet:TestSaleTimesheet,-test_mail,-test_mail_full,-test_mass_mailing,-test_xlsx_export,-.test_02_url_lang_code_underscore,-:TestTermCount.test_export_empty_string,-/test_lint:PotLinter.test_pot_duplicate_entries,-:TestPacking.test_picking_state_with_null_qty,-:TestLifoPrice.test_lifoprice
  • install_module install_module: {all},-web_decimal_numpad_dot,-web_widget_x2many_2d_matrix,-web_widget_open_tab,-web_widget_many2one_simple,-web_widget_x2many_2d_matrix_example,-web_editor_background_color,-web_disable_export_group,-web_dialog_size,-web_drop_target,-web_widget_url_advanced,-web_ir_actions_act_window_message,-web_tree_dynamic_colored_field,-web_advanced_search,-web_widget_domain_editor_dialog,-web_listview_range_select,-web_widget_one2many_product_picker_sale_stock,-web_translate_dialog,-web_pivot_computed_measure,-web_sheet_full_width,-web_widget_dropdown_dynamic,-web_environment_ribbon,-web_company_color,-web_timeline,-web_widget_numeric_step,-web_tree_image_tooltip,-web_tree_many2one_clickable,-web_widget_dropdown_dynamic_example,-web_ir_actions_act_view_reload,-web_domain_field,-web_widget_bokeh_chart,-web_widget_one2many_product_picker,-web_widget_image_download,-web_m2x_options,-web_refresher,-web_widget_one2many_product_picker_sale_secondary_unit,-web_notify,-web_group_expand,-web_no_bubble,-web_action_conditionable,-web_ir_actions_act_multi,-web_search_with_and,-web_pwa_oca,-web_calendar_slot_duration,-web_widget_mpld3_chart,-web_send_message_popup,-test_mail,-test_mail_full,-test_mass_mailing,-test_xlsx_export,-hw_drivers,-hw_escpos,-hw_posbox_homepage,-hw_proxy,-note_pad,-odoo_referral,-odoo_referral_portal,-pad,-pad_project,-pos_cache,-pos_six,-theme_bootswatch,-theme_default,-website_gengo,-web_tour,-web_unsplash,-l10n_latam_base,-l10n_ua,-l10n_hk,-l10n_es_edi_sii,-l10n_au,-l10n_dk,-l10n_uk,-l10n_id,-l10n_bo,-l10n_il,-l10n_cn_small_business,-l10n_hr,-l10n_co_pos,-l10n_cz,-l10n_ae,-l10n_pt,-l10n_it_stock_ddt,-l10n_id_efaktur,-l10n_de_repair,-l10n_be_edi,-l10n_it,-l10n_gt,-l10n_ch,-l10n_dz,-l10n_pa,-l10n_cr,-l10n_ve,-l10n_tr,-l10n_eu_service,-l10n_sg,-l10n_de_skr03,-l10n_ie,-l10n_jp,-l10n_ro,-l10n_nz,-l10n_fr,-l10n_de_sale,-l10n_in_sale,-l10n_ar_website_sale,-l10n_de_stock,-l10n_us,-l10n_pe,-l10n_cn_standard,-l10n_it_edi_sdicoop,-l10n_cn_city,-l10n_sa,-l10n_mn,-l10n_in_sale_stock,-l10n_do,-l10n_cl,-l10n_ar,-l10n_lt,-l10n_vn,-l10n_syscohada,-l10n_nl,-l10n_br,-l10n_mx,-l10n_hn,-l10n_ch_qriban,-l10n_in_purchase_stock,-l10n_si,-l10n_be,-l10n_fi,-l10n_in_pos,-l10n_za,-l10n_at,-l10n_ma,-l10n_pl,-l10n_ec,-l10n_fr_pos_cert,-l10n_in,-l10n_in_stock,-l10n_th,-l10n_ca,-l10n_de_skr04,-l10n_uy,-l10n_de_purchase,-l10n_latam_invoice_document,-l10n_et,-l10n_se_ocr,-l10n_es,-l10n_hu,-l10n_no,-l10n_be_invoice_bba,-l10n_in_purchase,-l10n_gr,-l10n_sk,-l10n_co,-l10n_it_edi,-l10n_de,-l10n_multilang,-l10n_cn,-l10n_fr_fec,-l10n_se,-l10n_lu

Test post install odoo 13.0

  • exec_odoo exec_odoo: --log-level=info --workers=0 --test-enable --http-interface 127.0.0.1 --test-tags=-at_install,-:TestLeadAssign,-:TestJournalMethods,-/test_l10n_be_hr_payroll_account:TestUi,-.test_01_sale_vat_book_vouchers,-.test_01_content_image_resize_placeholder,-.test_02_content_image_Etag_304,-.test_redirect_to_records,-.test_randomized_certification,-.test_flow_certificate,-.test_flow_public,-.test_unpublished_page,-.test_search,-.test_10_perf_sql_queries_page,-.test_20_perf_sql_queries_homepage,-.test_30_perf_sql_queries_page_no_layout,-.test_process_att_no_request,-.test_process_att_no_website,-.test_process_att_monolang_route,-.test_process_att_no_request_lang,-.test_process_att_with_request_lang,-.test_process_att_matching_cdn_and_lang,-.test_process_att_no_route,-.test_process_att_url_crap,-.test_get_switchable_related_views,-.test_create_visitor_on_tracked_page,-.test_long_period_inactivity,-.test_not_subscribed,-.test_not_subscribed_no_template,-.test_wrong_token,-.test_successful_unsubscribe,-.test_multi_website_views_retrieving,-.test_leave_whole_company_07,-.test_01_portal_attachment,-.test_10_crawl_public,-.test_20_crawl_demo,-.test_30_crawl_admin,-.test_check_suite,-.test_02_url_lang_code_underscore,-hr_contract:TestHrContracts,-hr_contract:TestContractCalendars,-hr_contract:TestHrContracts2,-stock_account:TestStockValuation,-stock_account:TestStockValuationStandard,-stock_account:TestStockValuationAVCO,-stock_account:TestStockValuationFIFO,-stock_account:TestStockValuationChangeCostMethod,-stock_account:TestStockValuationChangeValuation,-sale_timesheet:TestProjectBilling,-sale_timesheet:TestProjectBillingMulticompany,-sale_timesheet:TestReInvoice,-sale_timesheet:TestReporting,-sale_timesheet:TestSaleService,-sale_timesheet:TestSaleTimesheet,-test_mail,-test_mail_full,-test_mass_mailing,-test_xlsx_export,-.test_02_url_lang_code_underscore,-repair,-:TestPacking.test_picking_state_with_null_qty,-:TestLifoPrice.test_lifoprice
Create Date Level Message
01/12/2022 02:29:39 INFO
Start setup environment for runbot instance vle3vc1hbpaj-28656
01/12/2022 02:30:35 INFO
Fetching repository source code
01/12/2022 02:30:37 INFO
Create ref local branch to remote source
01/12/2022 02:30:39 INFO
Create working tree from branch: pr_vle3vc1hbpaj-28656
01/12/2022 02:30:40 INFO
Validating git dependencies source code
01/12/2022 02:30:41 INFO
Check and clone git dependencies source code
01/12/2022 02:30:41 INFO
Collected build addons:
01/12/2022 02:30:43 INFO
Deployed config file
01/12/2022 02:30:44 INFO
Running step: Test at install odoo 13.0
01/12/2022 02:30:45 INFO
Run command: create_db args: db
01/12/2022 02:30:46 INFO
Created database: vle3vc1hbpaj-28656_db
01/12/2022 02:30:46 INFO
Run command: set_opt args: demo,test
01/12/2022 02:30:46 INFO
Run command: set_opt args: test-tags=-post_install,-:TestLeadAssign,-:TestJournalMethods,-/test_l10n_be_hr_payroll_account:TestUi,-.test_01_sale_vat_book_vouchers,-.test_01_content_image_resize_placeholder,-.test_02_content_image_Etag_304,-.test_redirect_to_records,-.test_randomized_certification,-.test_flow_certificate,-.test_flow_public,-.test_unpublished_page,-.test_search,-.test_10_perf_sql_queries_page,-.test_20_perf_sql_queries_homepage,-.test_30_perf_sql_queries_page_no_layout,-.test_process_att_no_request,-.test_process_att_no_website,-.test_process_att_monolang_route,-.test_process_att_no_request_lang,-.test_process_att_with_request_lang,-.test_process_att_matching_cdn_and_lang,-.test_process_att_no_route,-.test_process_att_url_crap,-.test_get_switchable_related_views,-.test_create_visitor_on_tracked_page,-.test_long_period_inactivity,-.test_not_subscribed,-.test_not_subscribed_no_template,-.test_wrong_token,-.test_successful_unsubscribe,-.test_multi_website_views_retrieving,-.test_leave_whole_company_07,-hr_contract:TestHrContracts,-hr_contract:TestContractCalendars,-hr_contract:TestHrContracts2,-stock_account:TestStockValuation,-stock_account:TestStockValuationStandard,-stock_account:TestStockValuationAVCO,-stock_account:TestStockValuationFIFO,-stock_account:TestStockValuationChangeCostMethod,-stock_account:TestStockValuationChangeValuation,-sale_timesheet:TestProjectBilling,-sale_timesheet:TestProjectBillingMulticompany,-sale_timesheet:TestReInvoice,-sale_timesheet:TestReporting,-sale_timesheet:TestSaleService,-sale_timesheet:TestSaleTimesheet,-test_mail,-test_mail_full,-test_mass_mailing,-test_xlsx_export,-.test_02_url_lang_code_underscore,-:TestTermCount.test_export_empty_string,-/test_lint:PotLinter.test_pot_duplicate_entries,-:TestPacking.test_picking_state_with_null_qty,-:TestLifoPrice.test_lifoprice
01/12/2022 02:30:47 INFO
Run command: install_module args: {all},-web_decimal_numpad_dot,-web_widget_x2many_2d_matrix,-web_widget_open_tab,-web_widget_many2one_simple,-web_widget_x2many_2d_matrix_example,-web_editor_background_color,-web_disable_export_group,-web_dialog_size,-web_drop_target,-web_widget_url_advanced,-web_ir_actions_act_window_message,-web_tree_dynamic_colored_field,-web_advanced_search,-web_widget_domain_editor_dialog,-web_listview_range_select,-web_widget_one2many_product_picker_sale_stock,-web_translate_dialog,-web_pivot_computed_measure,-web_sheet_full_width,-web_widget_dropdown_dynamic,-web_environment_ribbon,-web_company_color,-web_timeline,-web_widget_numeric_step,-web_tree_image_tooltip,-web_tree_many2one_clickable,-web_widget_dropdown_dynamic_example,-web_ir_actions_act_view_reload,-web_domain_field,-web_widget_bokeh_chart,-web_widget_one2many_product_picker,-web_widget_image_download,-web_m2x_options,-web_refresher,-web_widget_one2many_product_picker_sale_secondary_unit,-web_notify,-web_group_expand,-web_no_bubble,-web_action_conditionable,-web_ir_actions_act_multi,-web_search_with_and,-web_pwa_oca,-web_calendar_slot_duration,-web_widget_mpld3_chart,-web_send_message_popup,-test_mail,-test_mail_full,-test_mass_mailing,-test_xlsx_export,-hw_drivers,-hw_escpos,-hw_posbox_homepage,-hw_proxy,-note_pad,-odoo_referral,-odoo_referral_portal,-pad,-pad_project,-pos_cache,-pos_six,-theme_bootswatch,-theme_default,-website_gengo,-web_tour,-web_unsplash,-l10n_latam_base,-l10n_ua,-l10n_hk,-l10n_es_edi_sii,-l10n_au,-l10n_dk,-l10n_uk,-l10n_id,-l10n_bo,-l10n_il,-l10n_cn_small_business,-l10n_hr,-l10n_co_pos,-l10n_cz,-l10n_ae,-l10n_pt,-l10n_it_stock_ddt,-l10n_id_efaktur,-l10n_de_repair,-l10n_be_edi,-l10n_it,-l10n_gt,-l10n_ch,-l10n_dz,-l10n_pa,-l10n_cr,-l10n_ve,-l10n_tr,-l10n_eu_service,-l10n_sg,-l10n_de_skr03,-l10n_ie,-l10n_jp,-l10n_ro,-l10n_nz,-l10n_fr,-l10n_de_sale,-l10n_in_sale,-l10n_ar_website_sale,-l10n_de_stock,-l10n_us,-l10n_pe,-l10n_cn_standard,-l10n_it_edi_sdicoop,-l10n_cn_city,-l10n_sa,-l10n_mn,-l10n_in_sale_stock,-l10n_do,-l10n_cl,-l10n_ar,-l10n_lt,-l10n_vn,-l10n_syscohada,-l10n_nl,-l10n_br,-l10n_mx,-l10n_hn,-l10n_ch_qriban,-l10n_in_purchase_stock,-l10n_si,-l10n_be,-l10n_fi,-l10n_in_pos,-l10n_za,-l10n_at,-l10n_ma,-l10n_pl,-l10n_ec,-l10n_fr_pos_cert,-l10n_in,-l10n_in_stock,-l10n_th,-l10n_ca,-l10n_de_skr04,-l10n_uy,-l10n_de_purchase,-l10n_latam_invoice_document,-l10n_et,-l10n_se_ocr,-l10n_es,-l10n_hu,-l10n_no,-l10n_be_invoice_bba,-l10n_in_purchase,-l10n_gr,-l10n_sk,-l10n_co,-l10n_it_edi,-l10n_de,-l10n_multilang,-l10n_cn,-l10n_fr_fec,-l10n_se,-l10n_lu
01/12/2022 02:30:51 INFO
Installed module(s): pos_epson_printer,product,website_mass_mailing,hr_skills_slides,calendar_sms,website_theme_install,website_sale_coupon_delivery,portal,partner_autocomplete,base_address_extended,account_debit_note,website_crm,base_setup,purchase_product_matrix,im_support,hr_maintenance,website_event_sale,hr_contract,payment_stripe_checkout_webhook,account_check_printing,website_form,mass_mailing_slides,social_media,base_geolocalize,mass_mailing_crm,hr_skills,website_slides_forum,website_sale_product_configurator,pos_mercury,pos_epson_printer_restaurant,sms,mrp,stock_picking_batch,website_crm_sms,website_partner,hr_timesheet_attendance,website_crm_livechat,website_google_map,website,base_iban,website_profile,attachment_indexation,website_event,sale_quotation_builder,repair,payment_buckaroo,payment_ingenico,sales_team,google_spreadsheet,website_blog,base_import_module,website_sms,purchase_mrp,sale_coupon_delivery,gamification_sale_crm,web,contacts,point_of_sale,website_links,im_livechat_mail_bot,link_tracker,base_sparse_field,hr_recruitment,crm_iap_lead_enrich,purchase_requisition_stock,stock,auth_ldap,sale_crm,account_bank_statement_import,pos_reprint,purchase_requisition,stock_sms,google_drive,website_rating,crm,website_livechat,auth_password_policy_signup,auth_password_policy,pos_restaurant,hr_work_entry,payment_payulatam,sale_timesheet,procurement_jit,hr_attendance,payment_payumoney,product_margin,hr_timesheet,mrp_subcontracting_account,mass_mailing,payment_authorize,sale_product_matrix,utm,mass_mailing_event_track,product_matrix,purchase,account,mrp_account,base_gengo,sale_management,website_membership,payment_stripe,snailmail_account,mass_mailing_sms,hr,test_website_slides_full,mail_bot,partner_autocomplete_address_extended,digest,bus,website_event_track,website_forum,website_sale_stock,calendar,sale_mrp,website_form_project,stock_account,im_livechat,transifex,sale_purchase,google_calendar,crm_iap_lead,pos_hr,website_sale_slides,l10n_generic_coa,snailmail,note,website_sale_comparison,mass_mailing_event_sms,sale,membership,gamification,stock_dropshipping,website_sale_wishlist,hr_expense,payment,stock_landed_costs,account_test,website_crm_partner_assign,base_vat,website_event_questions,project,web_kanban_gauge,account_analytic_default,website_slides_survey,product_email_template,sale_expense,hr_holidays_calendar,delivery,hr_expense_check,crm_iap_lead_website,auth_signup,mass_mailing_event_track_sms,account_lock,website_mail_channel,pos_sale,resource,mass_mailing_event,sale_product_configurator,maintenance,website_sale_management,base_import,website_slides,pos_kitchen_printer,hr_org_chart,website_mail,payment_sips,website_sale_stock_product_configurator,payment_adyen,website_customer,payment_transfer,website_sale_digital,web_diagram,hr_gamification,payment_test,web_editor,account_payment,project_timesheet_holidays,mrp_subcontracting_dropshipping,http_routing,website_sale_delivery,payment_alipay,sale_coupon,sale_margin,pos_adyen,base_address_city,base_automation,purchase_stock,analytic,hr_holidays_attendance,fetchmail,product_expiry,mrp_subcontracting,hr_holidays,crm_sms,iap,website_hr_recruitment,hr_skills_survey,event_sms,sale_stock,test_website,rating,hr_recruitment_survey,account_facturx,website_sale,barcodes,event,phone_validation,survey,account_analytic_default_hr_expense,account_analytic_default_purchase,uom,board,pos_cash_rounding,account_tax_python,google_account,sale_timesheet_purchase,association,website_twitter,website_payment,hr_fleet,event_sale,website_sale_coupon,mass_mailing_sale,lunch,fleet,pos_discount,mail,hr_presence,payment_paypal,auth_oauth,crm_livechat,to_attendance_device,to_erponline_utility,to_company_hotline,to_sale_purchase_multi_comp,to_l10n_vn_account_balance_carry_forward,to_maintenance_request_simple_mediate,to_sale_desc_short_link,to_warehouse_imp,to_hr_payroll,viin_base_district,to_orderpoint_mail_thread,to_purchase_bom_stock_value,to_promotion_voucher_pos_return,to_payment_terms_extended,viin_hr_overtime_attendance,to_fleet_vehicle_revenue_accounting,viin_helpdesk_sale,viin_l10n_vn_account_payment_internal_transfer,viin_account_regenerate_analytic_line,to_git_odoo_version,to_website_docs,to_accounting_entry_report_flag,to_hr_employee_grade,to_partner_employee_size,to_l10n_vn_account_detail_sheet,viin_product_standard_price_access_stock_account,to_location_warehouse,to_hr_shift_rotation,to_partner_share_holder,to_accounting_vninvoice_summary,to_replace_loyalty_pos_config,to_product_standard_price_access,viin_l10n_vn_vat_counterpart,to_sales_team_advanced_crm,to_partner_dob_send_email,to_account_counterpart_partner_balance,to_http_reroute_encoding,to_pos_delivery,viin_sale_product_duplication_warning,viin_helpdesk,to_uom_subscription,to_wallet_adjustment,to_okr,to_product_odoo_version,to_upload_file,to_maintenance_by_working_hours,to_multi_warehouse_access_control,to_partner_dob,to_res_state_group,viin_mobile,to_shorten_url,to_tvtma_hr,to_loyalty,to_employee_documents,to_registration_email_blacklist,to_stock_equipment_bom_kit,viin_repair_delete,to_partner_business_type,to_purchase_line_numbering,viin_hr_overtime_timesheet,to_website_recaptcha,to_fleet_insurance_basic,viin_hr_overtime_timesheet_attendance,to_bank_statement_reconcile_batch,viin_hr_overtime_approval_payroll,to_odoo_module,to_geo_routes,viin_user_assignment_log,to_website_docs_odoo_data,to_stock_block_quantity,to_sales_team_advanced_sale,to_equipment_hierarchy,payment_momo,to_odoo_module_sale,to_einvoice_summary,to_website_recaptcha_signup,to_repair_partner_info_from_lot,to_hr_employee_advance,to_legal_invoice_number,to_partner_nationality,to_hr_employee_birthday_filters,to_product_standard_price_access_account,to_hr_timesheet_payroll,to_repair_with_maintenance_schedule,to_token_expiration_test,viin_hr_seniority,to_accounting_vninvoice,to_backdate,to_web_thousand_sep,viin_repair_discount,viin_hr_overtime_timesheet_approval,to_hr_expense,viin_sales_unlink_stock,to_fleet_accounting,to_hr_resoucre_calendar_rate,viin_stock_specific_identification_landed_costs,to_repair_request_from_maintenance,to_fleet_stock,to_sale_backdate,viin_web_countup_timer,viin_hr_payroll_administrative_region,viin_survey_exam,to_hr_expense_payroll,to_loan_management,to_product_collection_sale,to_safe_confirm_button,to_config_management,viin_product_categ_mail_thread_stock_account,to_product_function,viin_sales_unlink,to_wallet,to_l10n_vn_stock_reports,to_hr_payroll_attendance,to_sale_price_lock,to_wallet_currency_conversion_diff,to_stock_landed_costs,to_procurement_approval,to_cash_flow_forecast,viin_project_timesheet_leave,to_website_docs_odoo,to_vietnam_bank_icons,l10n_vn_c200,to_account_income_deduct,to_product_license,to_l10n_vn_picking_operation,to_sale_wallet,viin_crm_employee_size,to_hr_barcode_in_emp_name,viin_fleet_accounting_purchase,to_payroll_payment_acb_templates,to_loyalty_pos,to_token_expiration,to_account_financial_income,to_stock_age_report,l10n_vn_c133,to_equipment_image,viin_transit_loc_accounts_specific_identification,to_stock_report_common,to_purchase_order_advance,to_partner_multilang_partner_autocomplete,to_event_project,viin_pricelist_recurring,to_hr_contract_actions,viin_l10n_vn_account_cash_book,to_fleet_driver_job_wage,to_affiliate,to_l10n_vn_fleet_driver,to_vietnamese_number2words,to_affiliate_sale,to_promotion_voucher_sale,to_fee_definition,viin_remove_only_reference_from_one2many,to_odoo_module_sale_template,to_accounting_sinvoice,to_account_counterpart_reports,viin_survey_time_limit_gt_1h,to_sales_stock_schedule,to_l10n_vn_foreign_trade,to_base,to_refund_account,to_stock_equipment,to_equipment_maintenance_schedule,to_paypal_unsupported_currencies,to_repair_supply,to_promotion_voucher_pos,viin_social_facebook_verify,to_l10n_vn_hr_payroll,to_mail_template_multilang_fix,to_warranty_purchase_stock,to_partner_ownership_type,viin_mobile_login,viin_hr_timesheet_timer,viin_social_linkedin,viin_crm_dob,to_invoice_line_summary,to_hr_timesheet_approval,to_sale_line_numbering,to_sales_target,to_fleet_specs,to_signup_email_verification,viin_l10n_vn_stock_reports_multi_warehouse_access_control,to_multi_warehouse_access_control_sale,to_product_function_sale,to_repair_request_from_warranty,to_account_payment,to_product_return_reason_pos,viin_fleet_vehicle_revenue_accounting_sale,viin_hr_overtime_approval,viin_website_helpdesk,to_loan_management_l10n_vn,viin_hr_activity_planning,to_partner_equity_range,to_purchase_landed_cost,viin_hr_attendance_validation,viin_message_emoji,to_fee_definition_sale,to_maintenance_notification,to_account_delegation_partner,to_hr_employee_resign,viin_l10n_vn_invoice_declaration,to_product_license_sale,to_product_code_sequence,to_hr_payroll_meal,to_slugify_l10n_vn,viin_meeting_room,to_hr_meal,viin_multi_warehouse_access_control_purchase_requisition,to_common_uom,to_l10n_vn_employee_advance,to_foreign_trade,to_promotion_voucher_pos_sale,viin_website_page_access_right,viin_administrative_region,viin_product_categ_mail_thread,viin_contacts_district,to_promotion_voucher_account_payment,viin_website_gtm,to_pos_frontend_return,viin_website_forum_security_groups,to_stock_account_moves_link,to_account_counterpart,viin_crm_detect_partner,to_multi_warehouse_access_control_mrp,to_website_search_suggestion_product,to_product_return_reason,to_fleet_stock_account,viin_queue,viin_survey_printing,to_sales_team_advanced,payment_nganluong,to_employee_changes_tracking,to_l10n_vn_state_group,to_website_slides_event,viin_crm_business_type,to_invoice_tax_details,to_loyalty_sales,to_promotion_voucher,to_product_standard_price_access_purchase,viin_l10n_vn_hr_payroll_account_overtime,payment_vnpay,to_pos_order_to_sales_order,to_l10n_vn_general_ledger,to_product_function_pos,to_account_expense_tracking,to_repair_extend,to_sales_target_sale,viin_hr_holidays,to_promotion_voucher_l10n_vn,to_stock_equipment_hierarchy,viin_helpdesk_timesheet,l10n_vn_c200_pos,to_procurement_requests,to_sshkey,to_stock_production_lot_partner_infor,viin_product_categ_mail_thread_purchase,viin_hr_overtime,to_org_chart,to_okr_project,to_pos_note,to_vat_counterpart,viin_social,to_bank_currency_rate,to_hr_expense_employee_advance,to_purchase_order_lines,to_mail_notif_and_email,to_stock_backdate,to_website_odoo_version,to_website_base,to_uom_mail_thread,viin_social_facebook,viin_hr_employee_resource_calendar,to_einvoice_common,viin_website_livechat,viin_mail_show_recipient,to_maintenance_approval,viin_website_hr_recruitment_website_editor,to_fleet_accounting_fleet_operation,to_hr_skills_recruitment,to_product_dimensions,to_fleet_load_params,to_website_affiliate,viin_project_kanban_state_notification,to_partner_check_unique_vat,to_product_pricelist_weekdays,viin_hr_account,viin_sale_crm_follower_access_right,to_warranty_purchase,to_website_apps_store,to_repair_access_group,viin_survey_recompute_results,to_fleet_operation_planning,to_holidays_in_years,to_stock_picking_backdate,to_foreign_trade_currency_rate,to_odoo_module_sale_project,to_hr_recruitment_request,viin_partner_gender,to_website_search_suggestion,to_l10n_vn_hr_payroll_account,to_product_collection,viin_website_nofollow,to_vendor_price_lock,to_fleet_accounting_fleet_operation_revenue,to_account_balance_carry_forward,to_project_access,to_warranty_management,to_approvals,viin_hr_project,to_accounting_bi,to_partner_tax_code,to_print_payment_vi,to_product_milestone,to_mrp_bom_component_percentage,viin_website_blog_access_right,viin_l10n_vn_hr_payroll_administrative_region,to_hr_employee_relative,viin_l10n_vn_einvoice_common,to_multi_warehouse_access_control_purchase,viin_helpdesk_livechat,to_l10n_vn_hr_payroll_meal_account,to_website_registration_email_blacklist,viin_sale_project,to_hr_training,to_product_return_reason_stock,to_project_stages,viin_hr_assignment_log,to_git,to_git_project,to_fleet_vehicle_revenue,to_mrp_backdate,to_account_bank_statement_import_rje,to_l10n_vn_qweb_layout,to_transit_loc_accounts,to_lines_count_on_account_move,viin_inventory_adjustment_with_cost_price,viin_partner_filter,to_stock_product_allocation,to_hr_employee_private_fields_access,viin_stock_specific_identification,viin_reverse_move_line,to_currency_conversion_diff,to_foreign_trade_landed_cost,to_partner_multilang,viin_hr_overtime_payroll,to_warranty_sale,to_partner_track_change,to_document_template,to_sale_order_advance,viin_sale_quotation_template_access,to_pos_refund_origin,viin_helpdesk_crm,to_repair_timesheet,to_fleet_driver,to_purchase_receipt,to_fleet_stock_picking,viin_payment_mediate,to_odoo_version,to_l10n_vn_currency_conversion_diff,to_mrp_bom_stock_value,to_hr_payroll_account,to_payment_transaction_protection,to_hr_holidays_period_limit,to_zoom_calendar,to_unique_product_code,payment_zalopay,to_multi_company_stock_location_account,to_bank_currency_rate_purchase_stock,to_product_maintenance_schedule,to_warranty_stock,to_tax_is_vat,to_equipment_partner_infor,to_warranty_sale_stock,to_event_timesheet,to_hr_work_day_type,to_hr_public_employee_birthday_filters,to_currency_rate,to_pos_analytics,to_sales_target_pos,to_purchase_backdate,to_product_collection_pos,viin_sale_project_technician,to_hr_project_timesheet_timeoff_payroll,to_equipment_woking_frequency,web_responsive,to_account_reports_report_off,viin_auto_currency_rate,to_enterprice_marks_inter_company,to_enterprice_marks_account,to_mrp_maintenance,to_enterprise_mobile,viin_web_map,to_mrp_mps,to_sale_subscription,to_hide_ent_modules_website_theme_install,to_mrp_account,viin_sale,to_account_accountant,to_account_asset,to_stock_asset_equipment,to_inter_company_invoice,to_account_budget_hr_timesheet,to_stock_barcode,to_quality_mrp,viin_mobile_notification,to_account_reports,to_mrp_barcode,viin_employee_map,to_inter_company_sale_purchase,to_stock_asset,to_cost_revenue_deferred,viin_auto_currency_rate_acb,to_l10n_vn_account_asset_sale,viin_web_dashboard,viin_website,to_hide_ent_modules,to_enterprice_marks_stock,to_inter_company_base,to_account_reports_l10n_vn,viin_crm,to_account_asset_purchase,viin_contacts_map,to_inter_company_sale_purchase_stock,viin_stock,to_quality_stock,to_account_budget,to_mrp_plm,to_quality,viin_auto_currency_rate_vcb,viin_web_cohort,to_mrp_workorder,to_l10n_vn_account_asset,to_enterprice_marks_mrp,viin_mrp_barcode_backdate,viin_mobile_notification_firebase,to_backend_theme,viin_brand_common,viin_brand,viin_brand_mail,viin_brand_im_livechat,viin_mrp_gantt,viin_web_gantt,viin_project_gantt,viin_webhook_client,viin_webhook,viin_api_client,viin_api,to_hr_salary_rule_datetime_libs,to_hr_overtime_payroll,to_hr_overtime,to_hr_subordinates,to_hr_overtime_with_shift_rotation,to_event_programs,viin_hr_holidays_accrual_holiday,test_assetsbundle,test_converter,test_new_api,test_action_bindings,test_inherit,test_uninstall,test_performance,test_rpc,base,test_inherits,test_lint,test_read_group,test_inherits_depends,test_limits,test_exceptions,test_testing_utilities,test_access_rights,test_translation_import,test_main_flows,test_mimetypes,test_impex,test_convert
01/12/2022 02:31:42 WARNING
invalid module names, ignored: viin_hr_overtime_payroll, viin_contacts_district, viin_hr_overtime, viin_hr_overtime_approval, viin_inventory_adjustment_with_cost_price, l10n_vn_c133, viin_l10n_vn_account_payment_internal_transfer, viin_l10n_vn_hr_payroll_account_overtime, viin_l10n_vn_stock_reports_multi_warehouse_access_control, viin_l10n_vn_vat_counterpart, viin_sales_unlink_stock, viin_pricelist_recurring, viin_web_countup_timer, viin_product_standard_price_access_stock_account, viin_hr_seniority, to_tvtma_hr, viin_crm_detect_partner, viin_hr_overtime_timesheet, viin_survey_printing, to_token_expiration_test, viin_repair_delete, to_promotion_voucher_pos_sale, viin_base_district, viin_l10n_vn_einvoice_common, viin_hr_employee_resource_calendar, viin_partner_filter, viin_stock_specific_identification_landed_costs, viin_hr_overtime_timesheet_approval, viin_administrative_region, viin_reverse_move_line, viin_sale_project_technician, viin_hr_timesheet_timer, viin_payment_mediate, to_promotion_voucher_sale, viin_fleet_accounting_purchase, viin_remove_only_reference_from_one2many, viin_queue, viin_hr_overtime_attendance, viin_transit_loc_accounts_specific_identification, viin_crm_dob, viin_mail_show_recipient, viin_hr_overtime_timesheet_attendance, viin_account_regenerate_analytic_line, viin_hr_project, viin_multi_warehouse_access_control_purchase_requisition, viin_hr_payroll_administrative_region, viin_website_gtm, viin_l10n_vn_hr_payroll_administrative_region, viin_stock_specific_identification, viin_fleet_vehicle_revenue_accounting_sale, viin_project_kanban_state_notification, viin_partner_gender, viin_hr_overtime_approval_payroll, viin_message_emoji, viin_sales_unlink, viin_repair_discount, viin_hr_attendance_validation
01/12/2022 02:35:47 ERROR
FAIL: TestPyLint.test_pylint
Traceback (most recent call last):
File "/opt/odoo/13.0/odoo/addons/test_lint/tests/test_pylint.py", line 91, in test_pylint
self.fail("pylint test failed:\n" + (b"\n" + out + b"\n" + err).decode('utf-8').strip())
AssertionError: pylint test failed:
************* Module build_src.to_website_docs_odoo.controllers.editor
Undefined variable '_' (E0602) at /home/vle3vc1hbpaj-28656/build_src/to_website_docs_odoo/controllers/editor.py:75
************* Module build_src.to_pos_frontend_return.models.pos_order
Undefined variable '_' (E0602) at /home/vle3vc1hbpaj-28656/build_src/to_pos_frontend_return/models/pos_order.py:74
************* Module build_src.to_l10n_vn_qweb_layout.models.report_l10n_vn_common
Undefined variable '_' (E0602) at /home/vle3vc1hbpaj-28656/build_src/to_l10n_vn_qweb_layout/models/report_l10n_vn_common.py:17
Undefined variable '_' (E0602) at /home/vle3vc1hbpaj-28656/build_src/to_l10n_vn_qweb_layout/models/report_l10n_vn_common.py:39
************* Module build_src.payment_zalopay.models.payment_transaction
Undefined variable '_' (E0602) at /home/vle3vc1hbpaj-28656/build_src/payment_zalopay/models/payment_transaction.py:65
************* Module build_src.to_hr_overtime_payroll.models.hr_overtime_line
Undefined variable '_' (E0602) at /home/vle3vc1hbpaj-28656/build_src/to_hr_overtime_payroll/models/hr_overtime_line.py:16
Undefined variable '_' (E0602) at /home/vle3vc1hbpaj-28656/build_src/to_hr_overtime_payroll/models/hr_overtime_line.py:23
************* Module build_src.to_attendance_device.models.finger_template
Possible SQL injection risk. (E8501) at /home/vle3vc1hbpaj-28656/build_src/to_attendance_device/models/finger_template.py:30
************* Module build_src.to_attendance_device.pyzk.zk.base
Unreachable code (W0101) at /home/vle3vc1hbpaj-28656/build_src/to_attendance_device/pyzk/zk/base.py:1497
************* Module build_src.to_hr_employee_advance.wizard.employee_advance_payment
Possible SQL injection risk. (E8501) at /home/vle3vc1hbpaj-28656/build_src/to_hr_employee_advance/wizard/employee_advance_payment.py:47
************* Module build_src.to_zoom_calendar.wizard.zoom_user_report
Undefined variable '_' (E0602) at /home/vle3vc1hbpaj-28656/build_src/to_zoom_calendar/wizard/zoom_user_report.py:25
Undefined variable '_' (E0602) at /home/vle3vc1hbpaj-28656/build_src/to_zoom_calendar/wizard/zoom_user_report.py:27
************* Module build_src.to_hr_shift_rotation.models.shift_rotation_rule
Undefined variable 'last_resource_calendar_id' (E0602) at /home/vle3vc1hbpaj-28656/build_src/to_hr_shift_rotation/models/shift_rotation_rule.py:87
Undefined variable 'last_resource_calendar_id' (E0602) at /home/vle3vc1hbpaj-28656/build_src/to_hr_shift_rotation/models/shift_rotation_rule.py:92
************* Module build_src.to_hr_expense.models.hr_expense
Undefined variable '_' (E0602) at /home/vle3vc1hbpaj-28656/build_src/to_hr_expense/models/hr_expense.py:108

------------------------------------
Your code has been rated at 10.00/10
01/12/2022 02:35:47 ERROR
Module test_lint: 1 failures, 0 errors
01/12/2022 02:35:56 ERROR
FAIL: TestSSHKeypair.test_company_sshkey_admin_key_user
Traceback (most recent call last):
File "/home/vle3vc1hbpaj-28656/build_src/to_sshkey/tests/test_sshkey_pair.py", line 54, in test_company_sshkey_admin_key_user
self.assertTrue(sshkey_pair not in self.ssh_demo_user.get_available_sshkey_pairs())
AssertionError: False is not true
01/12/2022 02:35:57 ERROR
ERROR: TestSSHKeypair.test_invalid_sshkey
Traceback (most recent call last):
File "/home/vle3vc1hbpaj-28656/build_src/to_sshkey/tests/test_sshkey_pair.py", line 24, in test_invalid_sshkey
self.create_sshkey_pair(self.invalid_sshkey_pair_vals, self.ssh_demo_user, self.ssh_demo_user.company_id)
File "/home/vle3vc1hbpaj-28656/build_src/to_sshkey/tests/common.py", line 136, in create_sshkey_pair
'company_id': company and company.id or False,
File "<decorator-gen-3>", line 2, in create
File "/opt/odoo/13.0/odoo/api.py", line 338, in _model_create_multi
return create(self, [arg])
File "/opt/odoo/13.0/odoo/models.py", line 3825, in create
records = self._create(data_list)
File "/opt/odoo/13.0/odoo/models.py", line 3998, in _create
records._validate_fields(name for data in data_list for name in data['stored'])
File "/opt/odoo/13.0/odoo/models.py", line 1212, in _validate_fields
check(self)
File "/home/vle3vc1hbpaj-28656/build_src/to_sshkey/models/sshkey_pair.py", line 47, in _check_privkey_bin
r.get_privkey()
File "/home/vle3vc1hbpaj-28656/build_src/to_sshkey/models/sshkey_pair.py", line 105, in get_privkey
return paramiko.RSAKey.from_private_key(file, password=privkey_passphrare)
File "/opt/python3.7-venv/odoo13/lib/python3.7/site-packages/paramiko/pkey.py", line 256, in from_private_key
key = cls(file_obj=file_obj, password=password)
File "/opt/python3.7-venv/odoo13/lib/python3.7/site-packages/paramiko/rsakey.py", line 52, in __init__
self._from_private_key(file_obj, password)
File "/opt/python3.7-venv/odoo13/lib/python3.7/site-packages/paramiko/rsakey.py", line 180, in _from_private_key
self._decode_key(data)
File "/opt/python3.7-venv/odoo13/lib/python3.7/site-packages/paramiko/rsakey.py", line 202, in _decode_key
).private_key(default_backend())
File "/opt/python3.7-venv/odoo13/lib/python3.7/site-packages/cryptography/hazmat/primitives/asymmetric/rsa.py", line 367, in private_key
return backend.load_rsa_private_numbers(self)
File "/opt/python3.7-venv/odoo13/lib/python3.7/site-packages/cryptography/hazmat/backends/openssl/backend.py", line 602, in load_rsa_private_numbers
return _RSAPrivateKey(self, rsa_cdata, evp_pkey)
File "/opt/python3.7-venv/odoo13/lib/python3.7/site-packages/cryptography/hazmat/backends/openssl/rsa.py", line 389, in __init__
raise ValueError("Invalid private key", errors)
ValueError: ('Invalid private key', [_OpenSSLErrorWithText(code=67764350, lib=4, func=160, reason=126, reason_text=b'error:040A007E:rsa routines:RSA_check_key_ex:iqmp not inverse of q')])
01/12/2022 02:35:57 ERROR
FAIL: TestSSHKeypair.test_personal_sshkey
Traceback (most recent call last):
File "/home/vle3vc1hbpaj-28656/build_src/to_sshkey/tests/test_sshkey_pair.py", line 40, in test_personal_sshkey
"The SSH Key %s should not be accessible by the user %s" % (sshkey_pair.display_name, self.ssh_demo_user2.name)
AssertionError: True is not false : The SSH Key test_id_rsa should not be accessible by the user SSH Demo User
01/12/2022 02:35:57 ERROR
ERROR: TestSSHKeypair.test_sshkey_wrong_password
Traceback (most recent call last):
File "/opt/python3.7-venv/odoo13/lib/python3.7/site-packages/paramiko/rsakey.py", line 187, in _decode_key
data, password=None, backend=default_backend()
File "/opt/python3.7-venv/odoo13/lib/python3.7/site-packages/cryptography/hazmat/primitives/serialization/base.py", line 37, in load_der_private_key
return backend.load_der_private_key(data, password)
File "/opt/python3.7-venv/odoo13/lib/python3.7/site-packages/cryptography/hazmat/backends/openssl/backend.py", line 1277, in load_der_private_key
password,
File "/opt/python3.7-venv/odoo13/lib/python3.7/site-packages/cryptography/hazmat/backends/openssl/backend.py", line 1448, in _load_key
self._handle_key_loading_error()
File "/opt/python3.7-venv/odoo13/lib/python3.7/site-packages/cryptography/hazmat/backends/openssl/backend.py", line 1491, in _handle_key_loading_error
"Could not deserialize key data. The data may be in an "
ValueError: Could not deserialize key data. The data may be in an incorrect format or it may be encrypted with an unsupported algorithm.

During handling of the above exception, another exception occurred:

Traceback (most recent call last):
File "/home/vle3vc1hbpaj-28656/build_src/to_sshkey/models/sshkey_pair.py", line 105, in get_privkey
return paramiko.RSAKey.from_private_key(file, password=privkey_passphrare)
File "/opt/python3.7-venv/odoo13/lib/python3.7/site-packages/paramiko/pkey.py", line 256, in from_private_key
key = cls(file_obj=file_obj, password=password)
File "/opt/python3.7-venv/odoo13/lib/python3.7/site-packages/paramiko/rsakey.py", line 52, in __init__
self._from_private_key(file_obj, password)
File "/opt/python3.7-venv/odoo13/lib/python3.7/site-packages/paramiko/rsakey.py", line 180, in _from_private_key
self._decode_key(data)
File "/opt/python3.7-venv/odoo13/lib/python3.7/site-packages/paramiko/rsakey.py", line 190, in _decode_key
raise SSHException(str(e))
paramiko.ssh_exception.SSHException: Could not deserialize key data. The data may be in an incorrect format or it may be encrypted with an unsupported algorithm.

During handling of the above exception, another exception occurred:

Traceback (most recent call last):
File "/home/vle3vc1hbpaj-28656/build_src/to_sshkey/tests/test_sshkey_pair.py", line 15, in test_sshkey_wrong_password
self.create_sshkey_pair(vals, self.ssh_demo_user, self.ssh_demo_user.company_id)
File "/home/vle3vc1hbpaj-28656/build_src/to_sshkey/tests/common.py", line 136, in create_sshkey_pair
'company_id': company and company.id or False,
File "<decorator-gen-3>", line 2, in create
File "/opt/odoo/13.0/odoo/api.py", line 338, in _model_create_multi
return create(self, [arg])
File "/opt/odoo/13.0/odoo/models.py", line 3825, in create
records = self._create(data_list)
File "/opt/odoo/13.0/odoo/models.py", line 3998, in _create
records._validate_fields(name for data in data_list for name in data['stored'])
File "/opt/odoo/13.0/odoo/models.py", line 1212, in _validate_fields
check(self)
File "/home/vle3vc1hbpaj-28656/build_src/to_sshkey/models/sshkey_pair.py", line 47, in _check_privkey_bin
r.get_privkey()
File "/home/vle3vc1hbpaj-28656/build_src/to_sshkey/models/sshkey_pair.py", line 113, in get_privkey
raise InvalidInput(_("Invalid private key or passphrare. Please note that,"
odoo.addons.to_sshkey.exceptions.InvalidInput: ('Invalid private key or passphrare. Please note that, when generating SSH Key with OpenSSH, you should add option `-m PEM` for RSA', '')
01/12/2022 02:35:57 ERROR
Module to_sshkey: 2 failures, 2 errors
01/12/2022 02:36:21 ERROR
ERROR: TestError.test_01_create
Traceback (most recent call last):
File "/opt/odoo/13.0/odoo/addons/test_rpc/tests/test_error.py", line 16, in setUp
self.rpc("res.users", "write", [uid], {"lang": False})
File "/usr/lib/python3.7/xmlrpc/client.py", line 1112, in __call__
return self.__send(self.__name, args)
File "/usr/lib/python3.7/xmlrpc/client.py", line 1452, in __request
verbose=self.__verbose
File "/usr/lib/python3.7/xmlrpc/client.py", line 1154, in request
return self.single_request(host, handler, request_body, verbose)
File "/usr/lib/python3.7/xmlrpc/client.py", line 1166, in single_request
http_conn = self.send_request(host, handler, request_body, verbose)
File "/usr/lib/python3.7/xmlrpc/client.py", line 1279, in send_request
self.send_content(connection, request_body)
File "/usr/lib/python3.7/xmlrpc/client.py", line 1309, in send_content
connection.endheaders(request_body)
File "/usr/lib/python3.7/http/client.py", line 1276, in endheaders
self._send_output(message_body, encode_chunked=encode_chunked)
File "/usr/lib/python3.7/http/client.py", line 1036, in _send_output
self.send(msg)
File "/usr/lib/python3.7/http/client.py", line 976, in send
self.connect()
File "/usr/lib/python3.7/http/client.py", line 948, in connect
(self.host,self.port), self.timeout, self.source_address)
File "/usr/lib/python3.7/socket.py", line 728, in create_connection
raise err
File "/usr/lib/python3.7/socket.py", line 716, in create_connection
sock.connect(sa)
ConnectionRefusedError: [Errno 111] Connection refused
01/12/2022 02:36:22 ERROR
ERROR: TestError.test_02_delete
Traceback (most recent call last):
File "/opt/odoo/13.0/odoo/addons/test_rpc/tests/test_error.py", line 16, in setUp
self.rpc("res.users", "write", [uid], {"lang": False})
File "/usr/lib/python3.7/xmlrpc/client.py", line 1112, in __call__
return self.__send(self.__name, args)
File "/usr/lib/python3.7/xmlrpc/client.py", line 1452, in __request
verbose=self.__verbose
File "/usr/lib/python3.7/xmlrpc/client.py", line 1154, in request
return self.single_request(host, handler, request_body, verbose)
File "/usr/lib/python3.7/xmlrpc/client.py", line 1166, in single_request
http_conn = self.send_request(host, handler, request_body, verbose)
File "/usr/lib/python3.7/xmlrpc/client.py", line 1279, in send_request
self.send_content(connection, request_body)
File "/usr/lib/python3.7/xmlrpc/client.py", line 1309, in send_content
connection.endheaders(request_body)
File "/usr/lib/python3.7/http/client.py", line 1276, in endheaders
self._send_output(message_body, encode_chunked=encode_chunked)
File "/usr/lib/python3.7/http/client.py", line 1036, in _send_output
self.send(msg)
File "/usr/lib/python3.7/http/client.py", line 976, in send
self.connect()
File "/usr/lib/python3.7/http/client.py", line 948, in connect
(self.host,self.port), self.timeout, self.source_address)
File "/usr/lib/python3.7/socket.py", line 728, in create_connection
raise err
File "/usr/lib/python3.7/socket.py", line 716, in create_connection
sock.connect(sa)
ConnectionRefusedError: [Errno 111] Connection refused
01/12/2022 02:36:22 ERROR
Module test_rpc: 0 failures, 2 errors
01/12/2022 02:37:11 ERROR
FAIL: TestToBase.test_find_first_date_of_period
Traceback (most recent call last):
File "/home/vle3vc1hbpaj-28656/build_src/to_base/tests/test_to_base.py", line 171, in test_find_first_date_of_period
"\nTest case TC06.03 - Test quarterly",
AssertionError: datetime.datetime(2021, 1, 1, 18, 3, 24) != datetime.date(2021, 1, 1) :
Test case TC06.03 - Test quarterly
01/12/2022 02:37:11 ERROR
FAIL: TestToBase.test_find_last_date_of_period
Traceback (most recent call last):
File "/home/vle3vc1hbpaj-28656/build_src/to_base/tests/test_to_base.py", line 239, in test_find_last_date_of_period
"\nTest case TC07.02 - Test monthly",
AssertionError: datetime.datetime(2021, 3, 31, 19, 53, 11) != datetime.datetime(2021, 3, 31, 0, 0) :
Test case TC07.02 - Test monthly
01/12/2022 02:37:11 ERROR
Module to_base: 2 failures, 0 errors
01/12/2022 02:37:12 WARNING
The model holiday.year has no _description
01/12/2022 02:39:12 WARNING
The model holiday.year has no _description
01/12/2022 02:42:24 WARNING
docutils' system message present: <system_message level="2" line="6" source="<string>" type="WARNING"><paragraph>Bullet list ends without a blank line; unexpected unindent.</paragraph></system_message>
01/12/2022 02:42:24 WARNING
Two fields (current_insurance_ids, insurance_ids) of fleet.vehicle() have the same label: Insurances.
01/12/2022 02:42:25 WARNING
Two fields (current_insurance_ids, insurance_ids) of fleet.vehicle() have the same label: Insurances.
01/12/2022 02:42:26 WARNING
Two fields (current_insurance_ids, insurance_ids) of fleet.vehicle() have the same label: Insurances.
01/12/2022 02:43:08 WARNING
docutils' system message present: <system_message level="1" line="7" source="<string>" type="INFO"><paragraph>Enumerated list start value not ordinal-1: "2" (ordinal 2)</paragraph></system_message>
01/12/2022 02:43:15 WARNING
Two fields (zoom_name, name) of calendar.event() have the same label: Meeting Subject.
01/12/2022 02:43:15 WARNING
Two fields (zoom_duration, duration) of calendar.event() have the same label: Duration.
01/12/2022 02:43:15 WARNING
Two fields (zoom_description, description) of calendar.event() have the same label: Description.
01/12/2022 02:43:15 WARNING
Two fields (zoom_interval, interval) of calendar.event() have the same label: Repeat Every.
01/12/2022 02:43:15 WARNING
Two fields (zoom_rrule_type, rrule_type) of calendar.event() have the same label: Recurrence.
01/12/2022 02:43:15 WARNING
Two fields (zoom_count, count) of calendar.event() have the same label: Repeat.
01/12/2022 02:43:15 WARNING
Two fields (zoom_final_date, final_date) of calendar.event() have the same label: Repeat Until.
01/12/2022 02:43:17 WARNING
Two fields (zoom_name, name) of calendar.event() have the same label: Meeting Subject.
01/12/2022 02:43:17 WARNING
Two fields (zoom_duration, duration) of calendar.event() have the same label: Duration.
01/12/2022 02:43:17 WARNING
Two fields (zoom_description, description) of calendar.event() have the same label: Description.
01/12/2022 02:43:17 WARNING
Two fields (zoom_interval, interval) of calendar.event() have the same label: Repeat Every.
01/12/2022 02:43:17 WARNING
Two fields (zoom_rrule_type, rrule_type) of calendar.event() have the same label: Recurrence.
01/12/2022 02:43:17 WARNING
Two fields (zoom_count, count) of calendar.event() have the same label: Repeat.
01/12/2022 02:43:17 WARNING
Two fields (zoom_final_date, final_date) of calendar.event() have the same label: Repeat Until.
01/12/2022 02:43:18 ERROR
bad query: INSERT INTO "calendar_meeting_room" ("id", "create_uid", "create_date", "write_uid", "write_date", "active", "name") VALUES (nextval('calendar_meeting_room_id_seq'), 1, (now() at time zone 'UTC'), 1, (now() at time zone 'UTC'), true, 'room 1') RETURNING id
ERROR: duplicate key value violates unique constraint "calendar_meeting_room_name_unique"
DETAIL: Key (name)=(room 1) already exists.
01/12/2022 02:43:18 ERROR
ERROR: TestMeetingRoom.test_generate_location
Traceback (most recent call last):
File "/home/vle3vc1hbpaj-28656/build_src/viin_meeting_room/tests/test_viin_meeting_room.py", line 10, in setUp
'name': 'room 1'
File "<decorator-gen-146>", line 2, in create
File "/opt/odoo/13.0/odoo/api.py", line 338, in _model_create_multi
return create(self, [arg])
File "/home/vle3vc1hbpaj-28656/build_src/viin_user_assignment_log/models/base.py", line 10, in create
records = super(Base, self).create(vals_list)
File "<decorator-gen-3>", line 2, in create
File "/opt/odoo/13.0/odoo/api.py", line 339, in _model_create_multi
return create(self, arg)
File "/opt/odoo/13.0/odoo/models.py", line 3825, in create
records = self._create(data_list)
File "/opt/odoo/13.0/odoo/models.py", line 3931, in _create
cr.execute(query, params)
File "/opt/odoo/13.0/odoo/sql_db.py", line 173, in wrapper
return f(self, *args, **kwargs)
File "/opt/odoo/13.0/odoo/sql_db.py", line 250, in execute
res = self._obj.execute(query, params)
psycopg2.IntegrityError: duplicate key value violates unique constraint "calendar_meeting_room_name_unique"
DETAIL: Key (name)=(room 1) already exists.
01/12/2022 02:43:18 ERROR
Module viin_meeting_room: 0 failures, 1 errors
01/12/2022 02:43:20 WARNING
Two fields (users_can_post, users_can_message) of social.page() have the same label: Users Can Message?.
01/12/2022 02:43:21 WARNING
Module viin_social_facebook demo data failed to install, installed without demo data
Traceback (most recent call last):
File "/opt/odoo/13.0/odoo/modules/loading.py", line 84, in load_demo
load_data(cr, idref, mode, kind='demo', package=package, report=report)
File "/opt/odoo/13.0/odoo/modules/loading.py", line 68, in load_data
tools.convert_file(cr, package.name, filename, idref, mode, noupdate, kind, report)
File "/opt/odoo/13.0/odoo/tools/convert.py", line 730, in convert_file
with file_open(pathname, 'rb') as fp:
File "/opt/odoo/13.0/odoo/tools/misc.py", line 203, in file_open
return _fileopen(name, mode=mode, basedir=rtp, pathinfo=pathinfo, basename=basename, filter_ext=filter_ext)
File "/opt/odoo/13.0/odoo/tools/misc.py", line 264, in _fileopen
raise IOError('File not found: %s' % basename)
OSError: File not found: viin_social_facebook/demo/demo.xml
01/12/2022 02:43:22 WARNING
Two fields (linkedin_date_expired, facebook_date_expired) of social.media() have the same label: Expired Date.
01/12/2022 02:43:22 WARNING
Two fields (users_can_post, users_can_message) of social.page() have the same label: Users Can Message?.
01/12/2022 02:43:26 WARNING
Two fields (zoom_name, name) of calendar.event() have the same label: Meeting Subject.
01/12/2022 02:43:26 WARNING
Two fields (zoom_duration, duration) of calendar.event() have the same label: Duration.
01/12/2022 02:43:26 WARNING
Two fields (zoom_description, description) of calendar.event() have the same label: Description.
01/12/2022 02:43:26 WARNING
Two fields (zoom_interval, interval) of calendar.event() have the same label: Repeat Every.
01/12/2022 02:43:26 WARNING
Two fields (zoom_rrule_type, rrule_type) of calendar.event() have the same label: Recurrence.
01/12/2022 02:43:26 WARNING
Two fields (zoom_count, count) of calendar.event() have the same label: Repeat.
01/12/2022 02:43:26 WARNING
Two fields (zoom_final_date, final_date) of calendar.event() have the same label: Repeat Until.
01/12/2022 02:44:03 ERROR
bad query: RELEASE SAVEPOINT "668892c4737b11ecb097f7e04f1c36be"
ERROR: savepoint "668892c4737b11ecb097f7e04f1c36be" does not exist
01/12/2022 02:44:03 WARNING
Module hr_holidays demo data failed to install, installed without demo data
Traceback (most recent call last):
File "/opt/odoo/13.0/odoo/modules/loading.py", line 84, in load_demo
load_data(cr, idref, mode, kind='demo', package=package, report=report)
File "/usr/lib/python3.7/contextlib.py", line 119, in __exit__
next(self.gen)
File "/opt/odoo/13.0/odoo/sql_db.py", line 454, in savepoint
self.execute('RELEASE SAVEPOINT "%s"' % name)
File "/opt/odoo/13.0/odoo/sql_db.py", line 173, in wrapper
return f(self, *args, **kwargs)
File "/opt/odoo/13.0/odoo/sql_db.py", line 250, in execute
res = self._obj.execute(query, params)
psycopg2.InternalError: savepoint "668892c4737b11ecb097f7e04f1c36be" does not exist
01/12/2022 02:44:03 ERROR
bad query: SELECT "ir_model_data".id FROM "ir_model_data" WHERE (("ir_model_data"."module" = 'base') AND ("ir_model_data"."name" = 'demo_failure_todo')) ORDER BY "ir_model_data"."module" ,"ir_model_data"."model" ,"ir_model_data"."name"
ERROR: current transaction is aborted, commands ignored until end of transaction block
01/12/2022 02:44:04 WARNING
Transient module states were reset
01/12/2022 02:44:04 ERROR
Failed to load registry
Traceback (most recent call last):
File "/opt/odoo/13.0/odoo/modules/loading.py", line 84, in load_demo
load_data(cr, idref, mode, kind='demo', package=package, report=report)
File "/usr/lib/python3.7/contextlib.py", line 119, in __exit__
next(self.gen)
File "/opt/odoo/13.0/odoo/sql_db.py", line 454, in savepoint
self.execute('RELEASE SAVEPOINT "%s"' % name)
File "/opt/odoo/13.0/odoo/sql_db.py", line 173, in wrapper
return f(self, *args, **kwargs)
File "/opt/odoo/13.0/odoo/sql_db.py", line 250, in execute
res = self._obj.execute(query, params)
psycopg2.InternalError: savepoint "668892c4737b11ecb097f7e04f1c36be" does not exist


During handling of the above exception, another exception occurred:

Traceback (most recent call last):
File "/opt/odoo/13.0/odoo/tools/cache.py", line 85, in lookup
r = d[key]
File "/opt/odoo/13.0/odoo/tools/func.py", line 69, in wrapper
return func(self, *args, **kwargs)
File "/opt/odoo/13.0/odoo/tools/lru.py", line 44, in __getitem__
a = self.d[obj].me
KeyError: ('ir.model.data', <function IrModelData.xmlid_lookup at 0x7fb1ef18c320>, 'base.demo_failure_todo')

During handling of the above exception, another exception occurred:

Traceback (most recent call last):
File "/opt/odoo/13.0/odoo/modules/registry.py", line 86, in new
odoo.modules.load_modules(registry._db, force_demo, status, update_module)
File "/opt/odoo/13.0/odoo/modules/loading.py", line 428, in load_modules
loaded_modules, update_module, models_to_check)
File "/opt/odoo/13.0/odoo/modules/loading.py", line 315, in load_marked_modules
perform_checks=perform_checks, models_to_check=models_to_check
File "/opt/odoo/13.0/odoo/modules/loading.py", line 226, in load_module_graph
demo_loaded = package.dbdemo = load_demo(cr, package, idref, mode, report)
File "/opt/odoo/13.0/odoo/modules/loading.py", line 93, in load_demo
todo = env.ref('base.demo_failure_todo', raise_if_not_found=False)
File "/opt/odoo/13.0/odoo/api.py", line 504, in ref
return self['ir.model.data'].xmlid_to_object(xml_id, raise_if_not_found=raise_if_not_found)
File "/opt/odoo/13.0/odoo/addons/base/models/ir_model.py", line 1712, in xmlid_to_object
t = self.xmlid_to_res_model_res_id(xmlid, raise_if_not_found)
File "/opt/odoo/13.0/odoo/addons/base/models/ir_model.py", line 1696, in xmlid_to_res_model_res_id
return self.xmlid_lookup(xmlid)[1:3]
File "<decorator-gen-26>", line 2, in xmlid_lookup
File "/opt/odoo/13.0/odoo/tools/cache.py", line 90, in lookup
value = d[key] = self.method(*args, **kwargs)
File "/opt/odoo/13.0/odoo/addons/base/models/ir_model.py", line 1683, in xmlid_lookup
xid = self.sudo().search([('module', '=', module), ('name', '=', name)])
File "/opt/odoo/13.0/odoo/models.py", line 1654, in search
res = self._search(args, offset=offset, limit=limit, order=order, count=count)
File "/opt/odoo/13.0/odoo/models.py", line 4512, in _search
self._cr.execute(query_str, where_clause_params)
File "/opt/odoo/13.0/odoo/sql_db.py", line 173, in wrapper
return f(self, *args, **kwargs)
File "/opt/odoo/13.0/odoo/sql_db.py", line 250, in execute
res = self._obj.execute(query, params)
psycopg2.InternalError: current transaction is aborted, commands ignored until end of transaction block
01/12/2022 02:44:04 CRITICAL
Failed to initialize database `vle3vc1hbpaj-28656_db`.
Traceback (most recent call last):
File "/opt/odoo/13.0/odoo/modules/loading.py", line 84, in load_demo
load_data(cr, idref, mode, kind='demo', package=package, report=report)
File "/usr/lib/python3.7/contextlib.py", line 119, in __exit__
next(self.gen)
File "/opt/odoo/13.0/odoo/sql_db.py", line 454, in savepoint
self.execute('RELEASE SAVEPOINT "%s"' % name)
File "/opt/odoo/13.0/odoo/sql_db.py", line 173, in wrapper
return f(self, *args, **kwargs)
File "/opt/odoo/13.0/odoo/sql_db.py", line 250, in execute
res = self._obj.execute(query, params)
psycopg2.InternalError: savepoint "668892c4737b11ecb097f7e04f1c36be" does not exist


During handling of the above exception, another exception occurred:

Traceback (most recent call last):
File "/opt/odoo/13.0/odoo/tools/cache.py", line 85, in lookup
r = d[key]
File "/opt/odoo/13.0/odoo/tools/func.py", line 69, in wrapper
return func(self, *args, **kwargs)
File "/opt/odoo/13.0/odoo/tools/lru.py", line 44, in __getitem__
a = self.d[obj].me
KeyError: ('ir.model.data', <function IrModelData.xmlid_lookup at 0x7fb1ef18c320>, 'base.demo_failure_todo')

During handling of the above exception, another exception occurred:

Traceback (most recent call last):
File "/opt/odoo/13.0/odoo/service/server.py", line 1192, in preload_registries
registry = Registry.new(dbname, update_module=update_module)
File "/opt/odoo/13.0/odoo/modules/registry.py", line 86, in new
odoo.modules.load_modules(registry._db, force_demo, status, update_module)
File "/opt/odoo/13.0/odoo/modules/loading.py", line 428, in load_modules
loaded_modules, update_module, models_to_check)
File "/opt/odoo/13.0/odoo/modules/loading.py", line 315, in load_marked_modules
perform_checks=perform_checks, models_to_check=models_to_check
File "/opt/odoo/13.0/odoo/modules/loading.py", line 226, in load_module_graph
demo_loaded = package.dbdemo = load_demo(cr, package, idref, mode, report)
File "/opt/odoo/13.0/odoo/modules/loading.py", line 93, in load_demo
todo = env.ref('base.demo_failure_todo', raise_if_not_found=False)
File "/opt/odoo/13.0/odoo/api.py", line 504, in ref
return self['ir.model.data'].xmlid_to_object(xml_id, raise_if_not_found=raise_if_not_found)
File "/opt/odoo/13.0/odoo/addons/base/models/ir_model.py", line 1712, in xmlid_to_object
t = self.xmlid_to_res_model_res_id(xmlid, raise_if_not_found)
File "/opt/odoo/13.0/odoo/addons/base/models/ir_model.py", line 1696, in xmlid_to_res_model_res_id
return self.xmlid_lookup(xmlid)[1:3]
File "<decorator-gen-26>", line 2, in xmlid_lookup
File "/opt/odoo/13.0/odoo/tools/cache.py", line 90, in lookup
value = d[key] = self.method(*args, **kwargs)
File "/opt/odoo/13.0/odoo/addons/base/models/ir_model.py", line 1683, in xmlid_lookup
xid = self.sudo().search([('module', '=', module), ('name', '=', name)])
File "/opt/odoo/13.0/odoo/models.py", line 1654, in search
res = self._search(args, offset=offset, limit=limit, order=order, count=count)
File "/opt/odoo/13.0/odoo/models.py", line 4512, in _search
self._cr.execute(query_str, where_clause_params)
File "/opt/odoo/13.0/odoo/sql_db.py", line 173, in wrapper
return f(self, *args, **kwargs)
File "/opt/odoo/13.0/odoo/sql_db.py", line 250, in execute
res = self._obj.execute(query, params)
psycopg2.InternalError: current transaction is aborted, commands ignored until end of transaction block
01/12/2022 02:44:06 INFO
Finished step: Test at install odoo 13.0 in 13m 21.70s
01/12/2022 02:44:07 INFO
Running step: Test post install odoo 13.0
01/12/2022 02:44:07 INFO
Run command: exec_odoo args: --log-level=info --workers=0 --test-enable --http-interface 127.0.0.1 --test-tags=-at_install,-:TestLeadAssign,-:TestJournalMethods,-/test_l10n_be_hr_payroll_account:TestUi,-.test_01_sale_vat_book_vouchers,-.test_01_content_image_resize_placeholder,-.test_02_content_image_Etag_304,-.test_redirect_to_records,-.test_randomized_certification,-.test_flow_certificate,-.test_flow_public,-.test_unpublished_page,-.test_search,-.test_10_perf_sql_queries_page,-.test_20_perf_sql_queries_homepage,-.test_30_perf_sql_queries_page_no_layout,-.test_process_att_no_request,-.test_process_att_no_website,-.test_process_att_monolang_route,-.test_process_att_no_request_lang,-.test_process_att_with_request_lang,-.test_process_att_matching_cdn_and_lang,-.test_process_att_no_route,-.test_process_att_url_crap,-.test_get_switchable_related_views,-.test_create_visitor_on_tracked_page,-.test_long_period_inactivity,-.test_not_subscribed,-.test_not_subscribed_no_template,-.test_wrong_token,-.test_successful_unsubscribe,-.test_multi_website_views_retrieving,-.test_leave_whole_company_07,-.test_01_portal_attachment,-.test_10_crawl_public,-.test_20_crawl_demo,-.test_30_crawl_admin,-.test_check_suite,-.test_02_url_lang_code_underscore,-hr_contract:TestHrContracts,-hr_contract:TestContractCalendars,-hr_contract:TestHrContracts2,-stock_account:TestStockValuation,-stock_account:TestStockValuationStandard,-stock_account:TestStockValuationAVCO,-stock_account:TestStockValuationFIFO,-stock_account:TestStockValuationChangeCostMethod,-stock_account:TestStockValuationChangeValuation,-sale_timesheet:TestProjectBilling,-sale_timesheet:TestProjectBillingMulticompany,-sale_timesheet:TestReInvoice,-sale_timesheet:TestReporting,-sale_timesheet:TestSaleService,-sale_timesheet:TestSaleTimesheet,-test_mail,-test_mail_full,-test_mass_mailing,-test_xlsx_export,-.test_02_url_lang_code_underscore,-repair,-:TestPacking.test_picking_state_with_null_qty,-:TestLifoPrice.test_lifoprice
01/12/2022 02:44:09 WARNING
The model holiday.year has no _description
01/12/2022 02:44:10 WARNING
The model holiday.year has no _description
01/12/2022 02:44:15 ERROR
ERROR: TestReports.test_reports
Traceback (most recent call last):
File "/opt/odoo/13.0/odoo/addons/base/tests/test_reports.py", line 19, in test_reports
self.env[report_model]
File "/opt/odoo/13.0/odoo/api.py", line 466, in __getitem__
return self.registry[model_name]._browse(self, (), ())
File "/opt/odoo/13.0/odoo/modules/registry.py", line 177, in __getitem__
return self.models[model_name]
KeyError: 'report.hr_holidays.report_holidayssummary'

During handling of the above exception, another exception occurred:

Traceback (most recent call last):
File "/opt/odoo/13.0/odoo/addons/base/tests/test_reports.py", line 23, in test_reports
report_model = self.env[report.model]
File "/opt/odoo/13.0/odoo/api.py", line 466, in __getitem__
return self.registry[model_name]._browse(self, (), ())
File "/opt/odoo/13.0/odoo/modules/registry.py", line 177, in __getitem__
return self.models[model_name]
KeyError: 'hr.leave.allocation'
01/12/2022 02:44:15 ERROR
Module base: 0 failures, 1 errors
01/12/2022 02:44:15 ERROR
ERROR: TestXMLRPC.test_01_xmlrpc_login
Traceback (most recent call last):
File "/opt/odoo/13.0/odoo/addons/base/tests/test_xmlrpc.py", line 17, in test_01_xmlrpc_login
uid = self.xmlrpc_common.login(db_name, 'admin', 'admin')
File "/usr/lib/python3.7/xmlrpc/client.py", line 1112, in __call__
return self.__send(self.__name, args)
File "/usr/lib/python3.7/xmlrpc/client.py", line 1452, in __request
verbose=self.__verbose
File "/usr/lib/python3.7/xmlrpc/client.py", line 1154, in request
return self.single_request(host, handler, request_body, verbose)
File "/usr/lib/python3.7/xmlrpc/client.py", line 1166, in single_request
http_conn = self.send_request(host, handler, request_body, verbose)
File "/usr/lib/python3.7/xmlrpc/client.py", line 1279, in send_request
self.send_content(connection, request_body)
File "/usr/lib/python3.7/xmlrpc/client.py", line 1309, in send_content
connection.endheaders(request_body)
File "/usr/lib/python3.7/http/client.py", line 1276, in endheaders
self._send_output(message_body, encode_chunked=encode_chunked)
File "/usr/lib/python3.7/http/client.py", line 1036, in _send_output
self.send(msg)
File "/usr/lib/python3.7/http/client.py", line 976, in send
self.connect()
File "/usr/lib/python3.7/http/client.py", line 948, in connect
(self.host,self.port), self.timeout, self.source_address)
File "/usr/lib/python3.7/socket.py", line 728, in create_connection
raise err
File "/usr/lib/python3.7/socket.py", line 716, in create_connection
sock.connect(sa)
ConnectionRefusedError: [Errno 111] Connection refused
01/12/2022 02:44:15 ERROR
ERROR: TestXMLRPC.test_jsonrpc_name_search
Traceback (most recent call last):
File "/opt/python3.7-venv/odoo13/lib/python3.7/site-packages/urllib3/connection.py", line 159, in _new_conn
(self._dns_host, self.port), self.timeout, **extra_kw)
File "/opt/python3.7-venv/odoo13/lib/python3.7/site-packages/urllib3/util/connection.py", line 80, in create_connection
raise err
File "/opt/python3.7-venv/odoo13/lib/python3.7/site-packages/urllib3/util/connection.py", line 70, in create_connection
sock.connect(sa)
ConnectionRefusedError: [Errno 111] Connection refused

During handling of the above exception, another exception occurred:

Traceback (most recent call last):
File "/opt/python3.7-venv/odoo13/lib/python3.7/site-packages/urllib3/connectionpool.py", line 600, in urlopen
chunked=chunked)
File "/opt/python3.7-venv/odoo13/lib/python3.7/site-packages/urllib3/connectionpool.py", line 354, in _make_request
conn.request(method, url, **httplib_request_kw)
File "/usr/lib/python3.7/http/client.py", line 1281, in request
self._send_request(method, url, body, headers, encode_chunked)
File "/usr/lib/python3.7/http/client.py", line 1327, in _send_request
self.endheaders(body, encode_chunked=encode_chunked)
File "/usr/lib/python3.7/http/client.py", line 1276, in endheaders
self._send_output(message_body, encode_chunked=encode_chunked)
File "/usr/lib/python3.7/http/client.py", line 1036, in _send_output
self.send(msg)
File "/usr/lib/python3.7/http/client.py", line 976, in send
self.connect()
File "/opt/python3.7-venv/odoo13/lib/python3.7/site-packages/urllib3/connection.py", line 181, in connect
conn = self._new_conn()
File "/opt/python3.7-venv/odoo13/lib/python3.7/site-packages/urllib3/connection.py", line 168, in _new_conn
self, "Failed to establish a new connection: %s" % e)
urllib3.exceptions.NewConnectionError: <urllib3.connection.HTTPConnection object at 0x7f2a9c341250>: Failed to establish a new connection: [Errno 111] Connection refused

During handling of the above exception, another exception occurred:

Traceback (most recent call last):
File "/opt/python3.7-venv/odoo13/lib/python3.7/site-packages/requests/adapters.py", line 449, in send
timeout=timeout
File "/opt/python3.7-venv/odoo13/lib/python3.7/site-packages/urllib3/connectionpool.py", line 638, in urlopen
_stacktrace=sys.exc_info()[2])
File "/opt/python3.7-venv/odoo13/lib/python3.7/site-packages/urllib3/util/retry.py", line 399, in increment
raise MaxRetryError(_pool, url, error or ResponseError(cause))
urllib3.exceptions.MaxRetryError: HTTPConnectionPool(host='127.0.0.1', port=8069): Max retries exceeded with url: /jsonrpc (Caused by NewConnectionError('<urllib3.connection.HTTPConnection object at 0x7f2a9c341250>: Failed to establish a new connection: [Errno 111] Connection refused'))

During handling of the above exception, another exception occurred:

Traceback (most recent call last):
File "/opt/odoo/13.0/odoo/addons/base/tests/test_xmlrpc.py", line 52, in test_jsonrpc_name_search
'res.partner', 'name_search', 'admin'
File "/opt/odoo/13.0/odoo/addons/base/tests/test_xmlrpc.py", line 63, in _json_call
'args': args
File "/opt/python3.7-venv/odoo13/lib/python3.7/site-packages/requests/sessions.py", line 581, in post
return self.request('POST', url, data=data, json=json, **kwargs)
File "/opt/python3.7-venv/odoo13/lib/python3.7/site-packages/requests/sessions.py", line 533, in request
resp = self.send(prep, **send_kwargs)
File "/opt/python3.7-venv/odoo13/lib/python3.7/site-packages/requests/sessions.py", line 646, in send
r = adapter.send(request, **kwargs)
File "/opt/python3.7-venv/odoo13/lib/python3.7/site-packages/requests/adapters.py", line 516, in send
raise ConnectionError(e, request=request)
requests.exceptions.ConnectionError: HTTPConnectionPool(host='127.0.0.1', port=8069): Max retries exceeded with url: /jsonrpc (Caused by NewConnectionError('<urllib3.connection.HTTPConnection object at 0x7f2a9c341250>: Failed to establish a new connection: [Errno 111] Connection refused'))
01/12/2022 02:44:15 ERROR
ERROR: TestXMLRPC.test_jsonrpc_read_group
Traceback (most recent call last):
File "/opt/python3.7-venv/odoo13/lib/python3.7/site-packages/urllib3/connection.py", line 159, in _new_conn
(self._dns_host, self.port), self.timeout, **extra_kw)
File "/opt/python3.7-venv/odoo13/lib/python3.7/site-packages/urllib3/util/connection.py", line 80, in create_connection
raise err
File "/opt/python3.7-venv/odoo13/lib/python3.7/site-packages/urllib3/util/connection.py", line 70, in create_connection
sock.connect(sa)
ConnectionRefusedError: [Errno 111] Connection refused

During handling of the above exception, another exception occurred:

Traceback (most recent call last):
File "/opt/python3.7-venv/odoo13/lib/python3.7/site-packages/urllib3/connectionpool.py", line 600, in urlopen
chunked=chunked)
File "/opt/python3.7-venv/odoo13/lib/python3.7/site-packages/urllib3/connectionpool.py", line 354, in _make_request
conn.request(method, url, **httplib_request_kw)
File "/usr/lib/python3.7/http/client.py", line 1281, in request
self._send_request(method, url, body, headers, encode_chunked)
File "/usr/lib/python3.7/http/client.py", line 1327, in _send_request
self.endheaders(body, encode_chunked=encode_chunked)
File "/usr/lib/python3.7/http/client.py", line 1276, in endheaders
self._send_output(message_body, encode_chunked=encode_chunked)
File "/usr/lib/python3.7/http/client.py", line 1036, in _send_output
self.send(msg)
File "/usr/lib/python3.7/http/client.py", line 976, in send
self.connect()
File "/opt/python3.7-venv/odoo13/lib/python3.7/site-packages/urllib3/connection.py", line 181, in connect
conn = self._new_conn()
File "/opt/python3.7-venv/odoo13/lib/python3.7/site-packages/urllib3/connection.py", line 168, in _new_conn
self, "Failed to establish a new connection: %s" % e)
urllib3.exceptions.NewConnectionError: <urllib3.connection.HTTPConnection object at 0x7f2a9c102a50>: Failed to establish a new connection: [Errno 111] Connection refused

During handling of the above exception, another exception occurred:

Traceback (most recent call last):
File "/opt/python3.7-venv/odoo13/lib/python3.7/site-packages/requests/adapters.py", line 449, in send
timeout=timeout
File "/opt/python3.7-venv/odoo13/lib/python3.7/site-packages/urllib3/connectionpool.py", line 638, in urlopen
_stacktrace=sys.exc_info()[2])
File "/opt/python3.7-venv/odoo13/lib/python3.7/site-packages/urllib3/util/retry.py", line 399, in increment
raise MaxRetryError(_pool, url, error or ResponseError(cause))
urllib3.exceptions.MaxRetryError: HTTPConnectionPool(host='127.0.0.1', port=8069): Max retries exceeded with url: /jsonrpc (Caused by NewConnectionError('<urllib3.connection.HTTPConnection object at 0x7f2a9c102a50>: Failed to establish a new connection: [Errno 111] Connection refused'))

During handling of the above exception, another exception occurred:

Traceback (most recent call last):
File "/opt/odoo/13.0/odoo/addons/base/tests/test_xmlrpc.py", line 44, in test_jsonrpc_read_group
'res.partner', 'read_group', [], ['is_company', 'color'], ['parent_id']
File "/opt/odoo/13.0/odoo/addons/base/tests/test_xmlrpc.py", line 63, in _json_call
'args': args
File "/opt/python3.7-venv/odoo13/lib/python3.7/site-packages/requests/sessions.py", line 581, in post
return self.request('POST', url, data=data, json=json, **kwargs)
File "/opt/python3.7-venv/odoo13/lib/python3.7/site-packages/requests/sessions.py", line 533, in request
resp = self.send(prep, **send_kwargs)
File "/opt/python3.7-venv/odoo13/lib/python3.7/site-packages/requests/sessions.py", line 646, in send
r = adapter.send(request, **kwargs)
File "/opt/python3.7-venv/odoo13/lib/python3.7/site-packages/requests/adapters.py", line 516, in send
raise ConnectionError(e, request=request)
requests.exceptions.ConnectionError: HTTPConnectionPool(host='127.0.0.1', port=8069): Max retries exceeded with url: /jsonrpc (Caused by NewConnectionError('<urllib3.connection.HTTPConnection object at 0x7f2a9c102a50>: Failed to establish a new connection: [Errno 111] Connection refused'))
01/12/2022 02:44:15 ERROR
ERROR: TestXMLRPC.test_xmlrpc_ir_model_search
Traceback (most recent call last):
File "/opt/odoo/13.0/odoo/addons/base/tests/test_xmlrpc.py", line 24, in test_xmlrpc_ir_model_search
ids = o.execute(db_name, self.admin_uid, 'admin', 'ir.model', 'search', [])
File "/usr/lib/python3.7/xmlrpc/client.py", line 1112, in __call__
return self.__send(self.__name, args)
File "/usr/lib/python3.7/xmlrpc/client.py", line 1452, in __request
verbose=self.__verbose
File "/usr/lib/python3.7/xmlrpc/client.py", line 1154, in request
return self.single_request(host, handler, request_body, verbose)
File "/usr/lib/python3.7/xmlrpc/client.py", line 1166, in single_request
http_conn = self.send_request(host, handler, request_body, verbose)
File "/usr/lib/python3.7/xmlrpc/client.py", line 1279, in send_request
self.send_content(connection, request_body)
File "/usr/lib/python3.7/xmlrpc/client.py", line 1309, in send_content
connection.endheaders(request_body)
File "/usr/lib/python3.7/http/client.py", line 1276, in endheaders
self._send_output(message_body, encode_chunked=encode_chunked)
File "/usr/lib/python3.7/http/client.py", line 1036, in _send_output
self.send(msg)
File "/usr/lib/python3.7/http/client.py", line 976, in send
self.connect()
File "/usr/lib/python3.7/http/client.py", line 948, in connect
(self.host,self.port), self.timeout, self.source_address)
File "/usr/lib/python3.7/socket.py", line 728, in create_connection
raise err
File "/usr/lib/python3.7/socket.py", line 716, in create_connection
sock.connect(sa)
ConnectionRefusedError: [Errno 111] Connection refused
01/12/2022 02:44:15 ERROR
ERROR: TestXMLRPC.test_xmlrpc_name_search
Traceback (most recent call last):
File "/opt/odoo/13.0/odoo/addons/base/tests/test_xmlrpc.py", line 38, in test_xmlrpc_name_search
'res.partner', 'name_search', "admin"
File "/usr/lib/python3.7/xmlrpc/client.py", line 1112, in __call__
return self.__send(self.__name, args)
File "/usr/lib/python3.7/xmlrpc/client.py", line 1452, in __request
verbose=self.__verbose
File "/usr/lib/python3.7/xmlrpc/client.py", line 1154, in request
return self.single_request(host, handler, request_body, verbose)
File "/usr/lib/python3.7/xmlrpc/client.py", line 1166, in single_request
http_conn = self.send_request(host, handler, request_body, verbose)
File "/usr/lib/python3.7/xmlrpc/client.py", line 1279, in send_request
self.send_content(connection, request_body)
File "/usr/lib/python3.7/xmlrpc/client.py", line 1309, in send_content
connection.endheaders(request_body)
File "/usr/lib/python3.7/http/client.py", line 1276, in endheaders
self._send_output(message_body, encode_chunked=encode_chunked)
File "/usr/lib/python3.7/http/client.py", line 1036, in _send_output
self.send(msg)
File "/usr/lib/python3.7/http/client.py", line 976, in send
self.connect()
File "/usr/lib/python3.7/http/client.py", line 948, in connect
(self.host,self.port), self.timeout, self.source_address)
File "/usr/lib/python3.7/socket.py", line 728, in create_connection
raise err
File "/usr/lib/python3.7/socket.py", line 716, in create_connection
sock.connect(sa)
ConnectionRefusedError: [Errno 111] Connection refused
01/12/2022 02:44:15 ERROR
ERROR: TestXMLRPC.test_xmlrpc_read_group
Traceback (most recent call last):
File "/opt/odoo/13.0/odoo/addons/base/tests/test_xmlrpc.py", line 32, in test_xmlrpc_read_group
'res.partner', 'read_group', [], ['is_company', 'color'], ['parent_id']
File "/usr/lib/python3.7/xmlrpc/client.py", line 1112, in __call__
return self.__send(self.__name, args)
File "/usr/lib/python3.7/xmlrpc/client.py", line 1452, in __request
verbose=self.__verbose
File "/usr/lib/python3.7/xmlrpc/client.py", line 1154, in request
return self.single_request(host, handler, request_body, verbose)
File "/usr/lib/python3.7/xmlrpc/client.py", line 1166, in single_request
http_conn = self.send_request(host, handler, request_body, verbose)
File "/usr/lib/python3.7/xmlrpc/client.py", line 1279, in send_request
self.send_content(connection, request_body)
File "/usr/lib/python3.7/xmlrpc/client.py", line 1309, in send_content
connection.endheaders(request_body)
File "/usr/lib/python3.7/http/client.py", line 1276, in endheaders
self._send_output(message_body, encode_chunked=encode_chunked)
File "/usr/lib/python3.7/http/client.py", line 1036, in _send_output
self.send(msg)
File "/usr/lib/python3.7/http/client.py", line 976, in send
self.connect()
File "/usr/lib/python3.7/http/client.py", line 948, in connect
(self.host,self.port), self.timeout, self.source_address)
File "/usr/lib/python3.7/socket.py", line 728, in create_connection
raise err
File "/usr/lib/python3.7/socket.py", line 716, in create_connection
sock.connect(sa)
ConnectionRefusedError: [Errno 111] Connection refused
01/12/2022 02:44:15 ERROR
Module base: 0 failures, 6 errors
01/12/2022 02:44:20 ERROR
ERROR: TestSelfAccessProfile.test_access_my_profile
Traceback (most recent call last):
File "/opt/odoo/13.0/addons/hr/tests/test_self_user_access.py", line 23, in test_access_my_profile
view_infos = james.fields_view_get(view_id=view.id)
File "/opt/odoo/13.0/addons/hr/models/res_users.py", line 151, in fields_view_get
return super(User, self).fields_view_get(view_id=view_id, view_type=view_type, toolbar=toolbar, submenu=submenu)
File "/opt/odoo/13.0/addons/web/models/models.py", line 232, in fields_view_get
r = super().fields_view_get(view_id, view_type, toolbar, submenu)
File "/opt/odoo/13.0/odoo/models.py", line 1564, in fields_view_get
xarch, xfields = View.postprocess_and_fields(self._name, etree.fromstring(result['arch']), view_id)
File "/opt/odoo/13.0/odoo/addons/base/models/ir_ui_view.py", line 994, in postprocess_and_fields
self.raise_view_error(message, view_id)
File "/opt/odoo/13.0/odoo/addons/base/models/ir_ui_view.py", line 614, in raise_view_error
raise ValueError(message)
ValueError: Field `show_leaves` does not exist

Error context:
View `res.users.preferences.form.inherit`
[view_id: 1227, xml_id: hr.res_users_view_form_profile, model: res.users, parent_id: 1225]
01/12/2022 02:44:20 ERROR
ERROR: TestSelfAccessProfile.test_profile_view_fields
Traceback (most recent call last):
File "/opt/odoo/13.0/addons/hr/tests/test_self_user_access.py", line 67, in test_profile_view_fields
view_infos = self.env['res.users'].with_user(user_all_groups).fields_view_get(view_id=view.id)
File "/opt/odoo/13.0/addons/hr/models/res_users.py", line 151, in fields_view_get
return super(User, self).fields_view_get(view_id=view_id, view_type=view_type, toolbar=toolbar, submenu=submenu)
File "/opt/odoo/13.0/addons/web/models/models.py", line 232, in fields_view_get
r = super().fields_view_get(view_id, view_type, toolbar, submenu)
File "/opt/odoo/13.0/odoo/models.py", line 1564, in fields_view_get
xarch, xfields = View.postprocess_and_fields(self._name, etree.fromstring(result['arch']), view_id)
File "/opt/odoo/13.0/odoo/addons/base/models/ir_ui_view.py", line 994, in postprocess_and_fields
self.raise_view_error(message, view_id)
File "/opt/odoo/13.0/odoo/addons/base/models/ir_ui_view.py", line 614, in raise_view_error
raise ValueError(message)
ValueError: Field `show_leaves` does not exist

Error context:
View `res.users.preferences.form.inherit`
[view_id: 1227, xml_id: hr.res_users_view_form_profile, model: res.users, parent_id: 1225]
01/12/2022 02:44:21 ERROR
ERROR: TestSelfAccessProfile.test_readonly_fields
Traceback (most recent call last):
File "/opt/odoo/13.0/addons/hr/tests/test_self_user_access.py", line 38, in test_readonly_fields
view_infos = james.fields_view_get(view_id=view.id)
File "/opt/odoo/13.0/addons/hr/models/res_users.py", line 151, in fields_view_get
return super(User, self).fields_view_get(view_id=view_id, view_type=view_type, toolbar=toolbar, submenu=submenu)
File "/opt/odoo/13.0/addons/web/models/models.py", line 232, in fields_view_get
r = super().fields_view_get(view_id, view_type, toolbar, submenu)
File "/opt/odoo/13.0/odoo/models.py", line 1564, in fields_view_get
xarch, xfields = View.postprocess_and_fields(self._name, etree.fromstring(result['arch']), view_id)
File "/opt/odoo/13.0/odoo/addons/base/models/ir_ui_view.py", line 994, in postprocess_and_fields
self.raise_view_error(message, view_id)
File "/opt/odoo/13.0/odoo/addons/base/models/ir_ui_view.py", line 614, in raise_view_error
raise ValueError(message)
ValueError: Field `show_leaves` does not exist

Error context:
View `res.users.preferences.form.inherit`
[view_id: 1227, xml_id: hr.res_users_view_form_profile, model: res.users, parent_id: 1225]
01/12/2022 02:44:21 ERROR
Module hr: 0 failures, 3 errors
01/12/2022 02:45:01 ERROR
Unable to find object 'hr.leave'
01/12/2022 02:45:01 ERROR
Unable to find object 'hr.leave'
01/12/2022 02:45:01 ERROR
Unable to find object 'hr.leave'
01/12/2022 02:45:01 ERROR
Unable to find object 'hr.leave'
01/12/2022 02:45:01 ERROR
Unable to find object 'hr.leave'
01/12/2022 02:45:01 ERROR
Unable to find object 'hr.leave'
01/12/2022 02:45:01 ERROR
Unable to find object 'hr.leave'
01/12/2022 02:45:01 ERROR
Unable to find object 'hr.leave'
01/12/2022 02:45:01 ERROR
Unable to find object 'hr.leave'
01/12/2022 02:45:01 ERROR
Unable to find object 'hr.leave'
01/12/2022 02:45:01 ERROR
Unable to find object 'hr.leave.allocation'
01/12/2022 02:45:01 ERROR
Unable to find object 'hr.leave.allocation'
01/12/2022 02:45:01 ERROR
Unable to find object 'hr.leave.allocation'
01/12/2022 02:45:01 ERROR
Unable to find object 'hr.leave.allocation'
01/12/2022 02:45:01 ERROR
Unable to find object 'hr.leave.allocation'
01/12/2022 02:45:01 ERROR
Unable to find object 'hr.leave.allocation'
01/12/2022 02:45:01 ERROR
Unable to find object 'hr.leave.allocation'
01/12/2022 02:45:01 ERROR
Unable to find object 'hr.leave.allocation'
01/12/2022 02:45:01 ERROR
Unable to find object 'hr.leave.allocation'
01/12/2022 02:45:01 ERROR
Unable to find object 'hr.leave.allocation'
01/12/2022 02:45:01 ERROR
Unable to find object 'hr.leave.allocation'
01/12/2022 02:45:01 ERROR
Unable to find object 'hr.leave.allocation'
01/12/2022 02:45:01 ERROR
Unable to find object 'hr.leave.allocation'
01/12/2022 02:45:01 ERROR
Unable to find object 'hr.leave.allocation'
01/12/2022 02:45:01 ERROR
Unable to find object 'hr.leave.allocation'
01/12/2022 02:45:01 ERROR
Unable to find object 'hr.leave.type'
01/12/2022 02:45:01 ERROR
Unable to find object 'hr.leave.type'
01/12/2022 02:45:01 ERROR
Unable to find object 'hr.leave.type'
01/12/2022 02:45:01 ERROR
Unable to find object 'hr.leave.type'
01/12/2022 02:45:01 ERROR
Unable to find object 'hr.leave.type'
01/12/2022 02:45:49 ERROR
Missing model hr.leave
01/12/2022 02:45:49 ERROR
Missing model hr.leave.type
01/12/2022 02:45:49 ERROR
Missing model hr.leave.allocation
01/12/2022 02:45:49 ERROR
Missing model hr.leave.report
01/12/2022 02:45:50 ERROR
Missing model hr.leave
01/12/2022 02:45:50 ERROR
Missing model hr.leave.type
01/12/2022 02:45:50 ERROR
Missing model hr.leave.allocation
01/12/2022 02:45:50 ERROR
Missing model hr.leave.report
01/12/2022 02:45:51 ERROR
Missing model hr.leave
01/12/2022 02:45:51 ERROR
Missing model hr.leave.type
01/12/2022 02:45:51 ERROR
Missing model hr.leave.allocation
01/12/2022 02:45:51 ERROR
Missing model hr.leave.report
01/12/2022 02:46:53 INFO
Finished step: Test post install odoo 13.0 in 02m 45.72s
01/12/2022 12:00:48 INFO
Revoking Proxy
01/12/2022 12:00:48 INFO
Revoked Proxy
01/12/2022 12:00:49 INFO
Revoking DNS
01/12/2022 12:00:50 INFO
Revoked DNS
01/12/2022 12:00:50 INFO
Revoking backend
01/12/2022 12:00:52 INFO
Revoked backend
01/12/2022 12:00:52 INFO
Revoking database
01/12/2022 12:00:52 INFO
Revoked database
01/12/2022 12:00:52 INFO
Marked as unlink
01/12/2022 12:00:53 INFO
Revoked Build